program: Orca
programVersion: 5.0.2
elementType: O N C C C C C C C C C C C C C C C C C C H H H H H H H H H H H H H H H H H H H H H H H H H H H H H H H H H H H
charge: 0
multiplicity: 1
keywords: wb97x-d3
keywords: def2-TZVPP
keywords: def2/J RIJCOSX
keywords: DEFGRID2
keywords: scfconv7
keywords: smallprint printgap noloewdin
keywords: NOSOSCF
formula: C18H35NO
InChI: InChI=1/C18H35NO/c1-16-14-19(15-17(2)20-16)18-12-10-8-6-4-3-5-7-9-11-13-18/h16-18H,3-15H2,1-2H3
55 atoms
O  -4.522611 0.24612 0.468277
N  -1.92199 -0.186753 -0.508084
C  -0.475503 -0.133408 -0.70993
C  0.013334 -1.541979 -1.085661
C  0.287067 0.560841 0.439388
C  -2.357666 -0.776975 0.739228
C  -2.60514 1.0651 -0.739479
C  -3.867522 -0.975495 0.72182
C  -4.112142 0.843131 -0.74029
C  1.472474 -1.693786 -1.542422
C  1.555418 1.262006 -0.026135
C  2.418811 -2.141664 -0.427189
C  2.363543 1.97913 1.052627
C  3.909013 -2.047808 -0.764206
C  3.78554 2.30815 0.569031
C  4.512596 -0.645455 -0.637497
C  4.863508 1.318287 1.025349
C  4.564322 -0.163357 0.811302
C  -4.384933 -1.511235 2.040384
C  -4.881289 2.13683 -0.904127
H  -0.334889 0.485766 -1.605183
H  -0.653133 -1.877748 -1.882255
H  -0.156932 -2.229038 -0.24974
H  0.528672 -0.160949 1.2271
H  -0.368475 1.302655 0.908444
H  -2.094841 -0.162038 1.618219
H  -1.88117 -1.75012 0.875176
H  -2.30561 1.458732 -1.714812
H  -2.361525 1.839111 0.01152
H  -4.099665 -1.692177 -0.082774
H  -4.344785 0.168996 -1.580612
H  1.824284 -0.770899 -2.011909
H  1.514691 -2.444999 -2.335883
H  1.296974 1.987591 -0.805471
H  2.201318 0.538975 -0.514527
H  2.173481 -3.179019 -0.181212
H  2.207638 -1.581773 0.487599
H  2.408945 1.368278 1.960581
H  1.841765 2.894219 1.344305
H  4.071434 -2.426066 -1.778232
H  4.466077 -2.720122 -0.104259
H  4.082387 3.299198 0.919999
H  3.781868 2.380331 -0.523323
H  3.959849 0.05796 -1.266492
H  5.527667 -0.655328 -1.045015
H  5.029667 1.470046 2.096265
H  5.809232 1.577426 0.538969
H  3.626813 -0.402885 1.320399
H  5.325377 -0.748836 1.336368
H  -3.933434 -2.477962 2.264975
H  -4.153301 -0.829266 2.859632
H  -5.465798 -1.6454 2.00822
H  -4.625898 2.616235 -1.849445
H  -5.955298 1.953687 -0.901306
H  -4.654389 2.834456 -0.097038
totalener: -837.05704868 hartree
nucrepener: 1725.49813210 hartree
electener: -2562.55518078 hartree
oneelecener: -4560.93918550 hartree
twoeener: 1998.38400472 hartree
kineticenergy: 832.82375812 hartree
xcener: -85.976059873413 hartree
chargesum: 0.0000000
charge: -0.323343 -0.148090 0.079283 -0.186445 -0.179832 -0.123681 -0.122387 0.146897 0.166240 -0.112438 -0.142719 -0.149144 -0.109000 -0.156674 -0.142429 -0.129832 -0.166574 -0.117613 -0.264608 -0.266429 0.049869 0.087416 0.060857 0.078466 0.083516 0.067108 0.086536 0.073526 0.059740 0.046491 0.043291 0.063267 0.084484 0.083106 -0.004948 0.079139 0.063371 0.059392 0.081523 0.072069 0.073870 0.077840 0.066565 0.063130 0.080608 0.075496 0.064880 0.060691 0.080163 0.071550 0.079653 0.092653 0.071380 0.092776 0.079343
qa: -0.3233 -0.1481 0.0793 -0.1864 -0.1798 -0.1237 -0.1224 0.1469 0.1662 -0.1124 -0.1427 -0.1491 -0.1090 -0.1567 -0.1424 -0.1298 -0.1666 -0.1176 -0.2646 -0.2664 0.0499 0.0874 0.0609 0.0785 0.0835 0.0671 0.0865 0.0735 0.0597 0.0465 0.0433 0.0633 0.0845 0.0831 -0.0049 0.0791 0.0634 0.0594 0.0815 0.0721 0.0739 0.0778 0.0666 0.0631 0.0806 0.0755 0.0649 0.0607 0.0802 0.0716 0.0797 0.0927 0.0714 0.0928 0.0793
va: 2.0413 2.8910 3.9493 3.9246 3.8536 3.8890 3.9410 3.9389 3.8886 3.8427 3.9117 3.8580 3.8560 3.9582 3.8674 3.8848 3.9524 3.8426 3.9444 3.9461 1.0064 1.0284 1.0123 1.0018 1.0122 1.0178 1.0065 1.0126 1.0172 1.0186 1.0197 1.0072 1.0037 1.0144 1.0251 1.0103 1.0114 1.0136 1.0091 1.0091 1.0075 1.0089 1.0058 1.0002 1.0090 1.0060 1.0115 1.0134 1.0093 1.0069 1.0133 1.0115 1.0070 1.0114 1.0132
dispcorr: -0.028762900 hartree
energy: -837.085811581988
dipole: 13.33518 -12.78720 0.54798 0.46246 -0.52839 -0.06594 1.23385 -1.39094 -0.15709
magnitude: 0.57386 au
magnitude: 1.45863 debye
