program: Orca
programVersion: 5.0.2
elementType: O N C C C C C C C C C C C C C C C C C C H H H H H H H H H H H H H H H H H H H H H H H H H H H H H H H H H H H
charge: 0
multiplicity: 1
keywords: wb97x-d3
keywords: def2-TZVPP
keywords: def2/J RIJCOSX
keywords: DEFGRID2
keywords: scfconv7
keywords: smallprint printgap noloewdin
keywords: NOSOSCF
formula: C18H35NO
InChI: InChI=1/C18H35NO/c1-16-14-19(15-17(2)20-16)18-12-10-8-6-4-3-5-7-9-11-13-18/h16-18H,3-15H2,1-2H3
55 atoms
O  -4.545022 0.253862 0.42399
N  -1.935445 -0.175778 -0.536014
C  -0.486099 -0.113513 -0.707604
C  0.043757 -1.523231 -1.013483
C  0.25452 0.641222 0.424603
C  -2.398475 -0.811812 0.67835
C  -2.599664 1.09382 -0.725131
C  -3.910384 -0.987187 0.629243
C  -4.109924 0.898849 -0.750519
C  1.496828 -1.640991 -1.491016
C  1.258058 1.663209 -0.112117
C  2.518356 -1.648463 -0.362462
C  2.216844 2.24936 0.927755
C  3.980792 -1.788891 -0.775937
C  3.396243 1.348187 1.307064
C  4.931509 -1.40415 0.368247
C  4.366014 1.132125 0.145916
C  5.424964 0.047511 0.333576
C  -4.456029 -1.579235 1.911358
C  -4.852924 2.213519 -0.861118
H  -0.341683 0.46685 -1.628197
H  -0.617364 -1.929386 -1.782217
H  -0.078405 -2.170482 -0.138396
H  0.734566 -0.064435 1.107371
H  -0.468985 1.181861 1.042824
H  -2.139508 -0.240276 1.587836
H  -1.939807 -1.797356 0.778721
H  -2.282845 1.520771 -1.681005
H  -2.350826 1.834197 0.057657
H  -4.138326 -1.661403 -0.212449
H  -4.346312 0.270204 -1.624512
H  1.728716 -0.836578 -2.198256
H  1.594777 -2.568773 -2.062795
H  0.687196 2.477843 -0.568081
H  1.828543 1.22655 -0.936606
H  2.273152 -2.456274 0.336123
H  2.414586 -0.734235 0.212291
H  1.65264 2.511612 1.828112
H  2.619022 3.19234 0.544245
H  4.186087 -1.167825 -1.654947
H  4.170143 -2.817299 -1.094505
H  3.028046 0.394454 1.695385
H  3.938175 1.805573 2.140069
H  5.814907 -2.046948 0.352806
H  4.440794 -1.613424 1.324322
H  4.876653 2.080746 -0.047228
H  3.812697 0.919986 -0.773104
H  5.999512 0.246843 1.243668
H  6.137611 0.139215 -0.491985
H  -4.231648 -0.940006 2.766319
H  -5.537407 -1.700018 1.854425
H  -4.01834 -2.560588 2.096595
H  -5.930065 2.05101 -0.885474
H  -4.627692 2.865816 -0.016472
H  -4.572813 2.734926 -1.776879
totalener: -837.05725708 hartree
nucrepener: 1727.00730687 hartree
electener: -2564.06456394 hartree
oneelecener: -4563.93728728 hartree
twoeener: 1999.87272334 hartree
kineticenergy: 832.82069131 hartree
xcener: -85.975617924248 hartree
chargesum: 0.0000000
charge: -0.323739 -0.136102 0.045292 -0.153716 -0.181780 -0.131861 -0.119794 0.156216 0.163460 -0.135368 -0.147381 -0.096660 -0.161066 -0.120071 -0.125203 -0.140970 -0.115661 -0.165405 -0.265012 -0.266556 0.050930 0.089557 0.056390 0.088756 0.085550 0.066237 0.083467 0.075831 0.060882 0.045178 0.043853 0.056155 0.077577 0.085763 0.071760 0.078465 -0.035590 0.073527 0.075971 0.058229 0.079157 0.062818 0.081036 0.078040 0.066887 0.079866 0.056111 0.065291 0.075790 0.079662 0.092730 0.071466 0.092929 0.079582 0.071524
qa: -0.3237 -0.1361 0.0453 -0.1537 -0.1818 -0.1319 -0.1198 0.1562 0.1635 -0.1354 -0.1474 -0.0967 -0.1611 -0.1201 -0.1252 -0.1410 -0.1157 -0.1654 -0.2650 -0.2666 0.0509 0.0896 0.0564 0.0888 0.0856 0.0662 0.0835 0.0758 0.0609 0.0452 0.0439 0.0562 0.0776 0.0858 0.0718 0.0785 -0.0356 0.0735 0.0760 0.0582 0.0792 0.0628 0.0810 0.0780 0.0669 0.0799 0.0561 0.0653 0.0758 0.0797 0.0927 0.0715 0.0929 0.0796 0.0715
va: 2.0414 2.9022 3.9699 3.9040 3.7668 3.9017 3.9313 3.9194 3.8946 3.9196 3.8594 3.8702 3.9654 3.8675 3.8799 3.8673 3.8389 3.9484 3.9452 3.9448 1.0066 1.0275 1.0153 0.9998 1.0076 1.0194 1.0092 1.0114 1.0168 1.0185 1.0192 1.0114 1.0098 1.0079 1.0098 1.0171 1.0219 1.0086 1.0076 1.0125 1.0097 0.9992 1.0081 1.0079 1.0058 1.0086 1.0157 1.0115 1.0057 1.0133 1.0114 1.0069 1.0112 1.0133 1.0069
dispcorr: -0.028887650 hartree
energy: -837.086144725784
dipole: 13.40246 -12.87810 0.52436 0.61507 -0.63245 -0.01737 1.33578 -1.45656 -0.12078
magnitude: 0.53837 au
magnitude: 1.36843 debye
