program: Orca
programVersion: 5.0.2
elementType: O N C C C C C C C C C C C C C C C C C C H H H H H H H H H H H H H H H H H H H H H H H H H H H H H H H H H H H
charge: 0
multiplicity: 1
keywords: wb97x-d3
keywords: def2-TZVPP
keywords: def2/J RIJCOSX
keywords: DEFGRID2
keywords: scfconv7
keywords: smallprint printgap noloewdin
keywords: NOSOSCF
formula: C18H35NO
InChI: InChI=1/C18H35NO/c1-16-14-19(15-17(2)20-16)18-12-10-8-6-4-3-5-7-9-11-13-18/h16-18H,3-15H2,1-2H3
55 atoms
O  -4.491086 -0.034715 0.385786
N  -1.675155 -0.214371 -0.029685
C  -0.445632 -0.462699 -0.79088
C  0.365708 -1.611069 -0.162057
C  0.365482 0.8331 -0.941748
C  -2.465907 0.888141 -0.547051
C  -2.51657 -1.391467 0.080905
C  -3.707074 1.128909 0.299262
C  -3.759609 -1.11338 0.913431
C  0.748033 -1.46121 1.317001
C  1.744901 0.665212 -1.564033
C  2.022814 -0.672957 1.6323
C  2.568135 1.948909 -1.533043
C  3.316535 -1.329837 1.154574
C  4.059733 1.73869 -1.810163
C  4.56795 -0.469442 1.35311
C  4.724849 0.648419 -0.963407
C  4.589335 0.835178 0.552848
C  -4.569737 2.235253 -0.27186
C  -4.675629 -2.317651 0.969554
H  -0.705223 -0.801787 -1.813514
H  1.25042 -1.784087 -0.777049
H  -0.204363 -2.53441 -0.279982
H  0.462551 1.301099 0.043581
H  -0.188275 1.54421 -1.55925
H  -2.77204 0.718385 -1.597132
H  -1.882284 1.807908 -0.526332
H  -1.971313 -2.192842 0.580091
H  -2.820189 -1.7751 -0.911529
H  -3.365753 1.417925 1.307157
H  -3.423337 -0.864193 1.933712
H  0.858162 -2.462221 1.745926
H  -0.088223 -0.998307 1.8468
H  1.655625 0.299112 -2.59242
H  2.291248 -0.103587 -1.024929
H  2.084753 -0.544892 2.717768
H  1.938889 0.337935 1.230006
H  2.444866 2.422223 -0.554105
H  2.169061 2.670508 -2.251371
H  3.232982 -1.615359 0.101279
H  3.450866 -2.273111 1.692824
H  4.579134 2.689403 -1.657297
H  4.200689 1.48871 -2.86581
H  5.450937 -1.063592 1.097934
H  4.664882 -0.231789 2.416899
H  5.784961 0.601997 -1.226211
H  4.32268 -0.323677 -1.258274
H  3.687717 1.40448 0.786988
H  5.413954 1.456846 0.910923
H  -4.017107 3.174104 -0.305002
H  -4.897541 1.997599 -1.284316
H  -5.455862 2.390691 0.342712
H  -5.563198 -2.102097 1.563728
H  -5.000147 -2.612757 -0.029031
H  -4.165147 -3.166264 1.425768
totalener: -837.05871569 hartree
nucrepener: 1743.08859804 hartree
electener: -2580.14731373 hartree
oneelecener: -4596.08757082 hartree
twoeener: 2015.94025709 hartree
kineticenergy: 832.82511573 hartree
xcener: -85.982768358353 hartree
chargesum: 0.0000000
charge: -0.324088 -0.174698 0.134858 -0.186749 -0.214846 -0.137939 -0.128297 0.155567 0.146896 -0.187350 -0.128644 -0.109399 -0.136084 -0.136618 -0.161872 -0.147141 -0.120526 -0.168037 -0.264208 -0.263922 0.063605 0.093525 0.098473 0.086103 0.087284 0.064693 0.077910 0.080471 0.075436 0.042396 0.045364 0.075897 0.085101 0.090874 0.001600 0.080212 0.040364 0.062653 0.078050 0.060088 0.077046 0.071832 0.070363 0.075338 0.069623 0.082253 0.067920 0.075655 0.085195 0.071324 0.079409 0.092999 0.092925 0.079360 0.071757
qa: -0.3241 -0.1747 0.1349 -0.1867 -0.2148 -0.1379 -0.1283 0.1556 0.1469 -0.1873 -0.1286 -0.1094 -0.1361 -0.1366 -0.1619 -0.1471 -0.1205 -0.1680 -0.2642 -0.2639 0.0636 0.0935 0.0985 0.0861 0.0873 0.0647 0.0779 0.0805 0.0754 0.0424 0.0454 0.0759 0.0851 0.0909 0.0016 0.0802 0.0404 0.0627 0.0781 0.0601 0.0770 0.0718 0.0704 0.0753 0.0696 0.0823 0.0679 0.0757 0.0852 0.0713 0.0794 0.0930 0.0929 0.0794 0.0718
va: 2.0440 2.9191 3.8282 3.8495 3.8665 3.9529 3.8762 3.9355 3.9702 3.9263 3.8718 3.8754 3.9052 3.8711 3.9499 3.9392 3.8572 3.8774 3.9417 3.9452 1.0156 1.0018 0.9949 1.0042 1.0082 1.0174 1.0041 1.0059 1.0236 1.0171 1.0136 1.0019 1.0362 1.0139 1.0307 1.0118 1.0229 1.0071 1.0141 1.0116 1.0128 1.0083 1.0082 1.0071 1.0098 1.0052 1.0052 1.0029 1.0074 1.0074 1.0132 1.0113 1.0113 1.0132 1.0067
dispcorr: -0.029302396 hartree
energy: -837.088018085168
dipole: 12.34474 -11.86307 0.48167 0.50856 -0.51701 -0.00845 -0.86135 0.79350 -0.06785
magnitude: 0.48650 au
magnitude: 1.23658 debye
