program: Orca
programVersion: 4.2.1
elementType: Cl Cl O N N N C C C C C C C C C C C C C C C H H H H H H H H H H H H H H H H H
charge: 0
multiplicity: 1
keywords: wb97x-d3
keywords: def2-TZVPP
keywords: def2/J RIJCOSX GRIDX6 NOFINALGRIDX
keywords: grid4 nofinalgrid
keywords: scfconv7
keywords: smallprint printgap noloewdin
keywords: NOSOSCF
formula: C15H17Cl2N3O
InChI: InChI=1/C15H17Cl2N3O/c1-15(2,3)14(21)13(20-9-18-8-19-20)6-10-4-5-11(16)7-12(10)17/h4-9,14,21H,1-3H3
38 atoms
Cl -1.127387 2.476341 -1.217996
Cl -5.403254 -0.569676 -0.159301
O  2.824964 1.387341 1.929909
N  1.263304 -1.422651 0.231886
N  1.792935 -2.446743 0.915096
N  0.739442 -3.188127 -0.921464
C  3.651144 0.81247 -0.242722
C  2.833574 0.344288 0.987512
C  3.688369 -0.288914 -1.304321
C  5.08564 1.085744 0.218209
C  3.0660 2.081774 -0.859906
C  1.417781 -0.082901 0.655364
C  0.369102 0.735737 0.720613
C  -1.035733 0.381505 0.486526
C  0.64273 -1.885904 -0.86042
C  -1.830954 1.145443 -0.366527
C  -1.643056 -0.694083 1.134819
C  1.449068 -3.476536 0.188858
C  -3.170939 0.866695 -0.577504
C  -2.97844 -0.999044 0.942149
C  -3.731734 -0.210906 0.086182
H  3.349473 -0.535966 1.395725
H  4.412953 -0.028733 -2.077748
H  3.989818 -1.25409 -0.890547
H  2.730461 -0.418974 -1.809318
H  5.527923 0.20566 0.690958
H  5.143039 1.911361 0.927005
H  5.712051 1.346189 -0.63681
H  2.039064 1.939732 -1.201321
H  3.655286 2.374321 -1.73123
H  3.075574 2.922901 -0.166323
H  0.571091 1.770437 0.970415
H  2.423167 1.059598 2.74181
H  0.15926 -1.246659 -1.582095
H  -1.06455 -1.296592 1.822483
H  1.721482 -4.481244 0.47029
H  -3.761013 1.476512 -1.247066
H  -3.42559 -1.834108 1.462579
elementType: Cl O N C H
totalener: -1741.79170705 hartree
nucrepener: 1977.96657925 hartree
electener: -3719.75828629 hartree
oneelecener: -6317.86620201 hartree
twoeener: 2598.10791572 hartree
cpcmener: -0.02558592 hartree
kineticenergy: 1736.91541831 hartree
xcener: -122.680615034801 hartree
chargesum: 0.0000000
charge: -0.074859 -0.084289 -0.416101 0.141153 -0.347255 -0.384009 0.279389 0.146786 -0.366983 -0.333039 -0.364798 -0.062975 -0.084670 -0.050232 0.057339 0.034961 -0.127143 0.082647 -0.171861 -0.172411 0.123894 0.134200 0.106683 0.105044 0.096446 0.097711 0.095975 0.095990 0.085359 0.106640 0.100259 0.146576 0.226534 0.184951 0.152054 0.164420 0.127378 0.148238
qa: -0.0749 -0.0843 -0.4161 0.1412 -0.3473 -0.3840 0.2794 0.1468 -0.3670 -0.3330 -0.3648 -0.0630 -0.0847 -0.0502 0.0573 0.0350 -0.1271 0.0826 -0.1719 -0.1724 0.1239 0.1342 0.1067 0.1050 0.0964 0.0977 0.0960 0.0960 0.0854 0.1066 0.1003 0.1466 0.2265 0.1850 0.1521 0.1644 0.1274 0.1482
va: 1.2528 1.2197 2.0263 3.3388 2.8467 3.0675 3.6175 3.9063 3.9541 3.9169 3.9472 3.8375 3.8033 3.5786 4.0582 3.9482 3.8576 4.0147 4.0996 4.0355 3.8453 1.0114 1.0080 1.0069 0.9991 1.0029 1.0165 1.0054 1.0059 1.0065 1.0164 1.0253 1.0063 0.9898 1.0034 0.9933 1.0222 1.0046
dispcorr: -0.022677001 hartree
energy: -1741.814384047728
dipole: 42.95934 -42.78680 0.17253 1.39017 -1.05265 0.33752 1.11702 -0.49122 0.62580
magnitude: 0.73165 au
magnitude: 1.85971 debye
