program: Orca
programVersion: 4.2.1
elementType: Cl Cl O N N N C C C C C C C C C C C C C C C H H H H H H H H H H H H H H H H H
charge: 0
multiplicity: 1
keywords: wb97x-d3
keywords: def2-TZVPP
keywords: def2/J RIJCOSX GRIDX6 NOFINALGRIDX
keywords: grid4 nofinalgrid
keywords: scfconv7
keywords: smallprint printgap noloewdin
keywords: NOSOSCF
formula: C15H17Cl2N3O
InChI: InChI=1/C15H17Cl2N3O/c1-15(2,3)14(21)13(20-9-18-8-19-20)6-10-4-5-11(16)7-12(10)17/h4-9,14,21H,1-3H3
38 atoms
Cl -1.308931 2.753625 0.577708
Cl -5.433672 -0.624175 0.047176
O  3.425168 -0.499619 -1.808327
N  1.257432 -1.19869 0.10036
N  1.917248 -2.30888 -0.264395
N  0.765399 -2.671985 1.619289
C  3.650955 0.887934 0.229737
C  2.785528 0.448545 -0.981096
C  2.87921 1.92958 1.039909
C  4.919881 1.537265 -0.330048
C  4.067244 -0.266644 1.143887
C  1.383268 0.008066 -0.626295
C  0.308378 0.729966 -0.933246
C  -1.092255 0.371695 -0.673049
C  0.581018 -1.435767 1.231174
C  -1.94126 1.256056 -0.010309
C  -1.633289 -0.837823 -1.106768
C  1.589575 -3.160454 0.67233
C  -3.275379 0.966054 0.219588
C  -2.961632 -1.156712 -0.888736
C  -3.771456 -0.246899 -0.22735
H  2.657548 1.3433 -1.598049
H  3.513636 2.339465 1.828014
H  2.548954 2.765522 0.418312
H  1.993549 1.512511 1.523503
H  5.53514 1.929688 0.481168
H  4.68575 2.369997 -0.99646
H  5.529493 0.825232 -0.886828
H  4.769574 0.101079 1.894795
H  4.577728 -1.063001 0.599658
H  3.234526 -0.707025 1.693432
H  0.484018 1.686194 -1.412815
H  3.340575 -1.37254 -1.399065
H  -0.005926 -0.688199 1.740317
H  -1.006634 -1.539128 -1.641584
H  1.957862 -4.173821 0.669832
H  -3.910222 1.670188 0.738845
H  -3.359585 -2.098494 -1.239519
elementType: Cl O N C H
totalener: -1741.79178045 hartree
nucrepener: 1981.48293108 hartree
electener: -3723.27471154 hartree
oneelecener: -6324.55753708 hartree
twoeener: 2601.28282554 hartree
cpcmener: -0.02438989 hartree
kineticenergy: 1736.92400671 hartree
xcener: -122.683679265459 hartree
chargesum: 0.0000000
charge: -0.070692 -0.082789 -0.454772 0.159119 -0.368082 -0.374412 0.249328 0.174963 -0.344197 -0.340856 -0.368023 -0.127074 -0.010431 -0.040959 0.054233 0.034577 -0.122709 0.103115 -0.162085 -0.165433 0.116895 0.103885 0.106156 0.098125 0.087168 0.096767 0.098591 0.097056 0.105882 0.097415 0.099389 0.140668 0.235965 0.174330 0.155628 0.166316 0.127385 0.149556
qa: -0.0707 -0.0828 -0.4548 0.1591 -0.3681 -0.3744 0.2493 0.1750 -0.3442 -0.3409 -0.3680 -0.1271 -0.0104 -0.0410 0.0542 0.0346 -0.1227 0.1031 -0.1621 -0.1654 0.1169 0.1039 0.1062 0.0981 0.0872 0.0968 0.0986 0.0971 0.1059 0.0974 0.0994 0.1407 0.2360 0.1743 0.1556 0.1663 0.1274 0.1496
va: 1.2556 1.2211 1.9656 3.3071 2.8276 3.0614 3.6673 3.9660 3.9510 3.9163 3.9545 3.9602 3.7981 3.6047 4.0781 3.9490 3.8485 3.9884 4.0932 4.0251 3.8524 1.0158 1.0070 1.0086 1.0034 1.0063 1.0027 1.0180 1.0078 1.0143 0.9989 1.0130 1.0428 0.9960 1.0008 0.9923 1.0217 1.0038
dispcorr: -0.023068916 hartree
energy: -1741.814849370497
dipole: 43.50099 -43.68221 -0.18122 1.76903 -1.07464 0.69439 1.36033 -1.22972 0.13061
magnitude: 0.72944 au
magnitude: 1.85408 debye
