program: Orca
programVersion: 4.2.1
elementType: Cl Cl O N N N C C C C C C C C C C C C C C C H H H H H H H H H H H H H H H H H
charge: 0
multiplicity: 1
keywords: wb97x-d3
keywords: def2-TZVPP
keywords: def2/J RIJCOSX GRIDX6 NOFINALGRIDX
keywords: grid4 nofinalgrid
keywords: scfconv7
keywords: smallprint printgap noloewdin
keywords: NOSOSCF
formula: C15H17Cl2N3O
InChI: InChI=1/C15H17Cl2N3O/c1-15(2,3)14(21)13(20-9-18-8-19-20)6-10-4-5-11(16)7-12(10)17/h4-9,14,21H,1-3H3
38 atoms
Cl -1.122607 2.53676 -1.080631
Cl -5.409684 -0.58188 -0.303434
O  2.762017 1.102634 2.207091
N  1.250494 -1.410525 0.093924
N  1.787335 -2.488413 0.680081
N  0.722889 -3.070209 -1.200494
C  3.678981 0.827295 -0.058901
C  2.799077 0.255473 1.087582
C  3.145043 2.169405 -0.562483
C  3.733272 -0.149627 -1.23416
C  5.098846 1.013459 0.482904
C  1.392403 -0.121204 0.65749
C  0.337719 0.6813 0.785509
C  -1.061137 0.34177 0.49281
C  0.619647 -1.778202 -1.032305
C  -1.84076 1.154333 -0.328288
C  -1.677136 -0.772448 1.062212
C  1.441618 -3.457062 -0.1251
C  -3.174651 0.88444 -0.584955
C  -3.006712 -1.069383 0.822367
C  -3.745277 -0.233274 -0.000249
H  3.279602 -0.667169 1.429609
H  3.764342 2.528756 -1.386332
H  2.122674 2.096008 -0.937778
H  3.16846 2.958158 0.19473
H  4.483442 0.182632 -1.954219
H  2.789346 -0.207614 -1.777206
H  4.011801 -1.158367 -0.921432
H  5.510096 0.071736 0.853741
H  5.144783 1.738311 1.296471
H  5.761976 1.370453 -0.307235
H  0.512736 1.685299 1.154427
H  2.671983 2.018291 1.924544
H  0.127704 -1.079579 -1.690864
H  -1.108097 -1.415124 1.721586
H  1.719283 -4.481896 0.065875
H  -3.752876 1.531434 -1.229852
H  -3.460915 -1.936784 1.280583
elementType: Cl O N C H
totalener: -1741.79905048 hartree
nucrepener: 1976.05847164 hartree
electener: -3717.85752211 hartree
oneelecener: -6313.91675535 hartree
twoeener: 2596.05923323 hartree
cpcmener: -0.02390441 hartree
kineticenergy: 1736.88855488 hartree
xcener: -122.675713541123 hartree
chargesum: 0.0000000
charge: -0.073736 -0.082041 -0.418946 0.139520 -0.342585 -0.376973 0.225844 0.154762 -0.361405 -0.361579 -0.322308 -0.014927 -0.091786 -0.061133 0.053821 0.036105 -0.117948 0.082806 -0.172441 -0.171505 0.123787 0.126062 0.106401 0.094433 0.094089 0.105344 0.095877 0.105095 0.099596 0.094849 0.097098 0.139147 0.225136 0.182667 0.151327 0.162947 0.126343 0.146258
qa: -0.0737 -0.0820 -0.4189 0.1395 -0.3426 -0.3770 0.2258 0.1548 -0.3614 -0.3616 -0.3223 -0.0149 -0.0918 -0.0611 0.0538 0.0361 -0.1179 0.0828 -0.1724 -0.1715 0.1238 0.1261 0.1064 0.0944 0.0941 0.1053 0.0959 0.1051 0.0996 0.0948 0.0971 0.1391 0.2251 0.1827 0.1513 0.1629 0.1263 0.1463
va: 1.2538 1.2219 2.0245 3.3633 2.8394 3.0669 3.7053 3.9374 3.9523 3.9499 3.9237 3.7447 3.8389 3.5974 4.0578 3.9410 3.8538 4.0120 4.1004 4.0376 3.8529 1.0244 1.0062 1.0041 1.0095 1.0079 0.9994 1.0076 1.0028 1.0173 1.0060 1.0160 1.0215 0.9904 1.0031 0.9933 1.0224 1.0051
dispcorr: -0.022710422 hartree
energy: -1741.821760902030
dipole: 43.49563 -43.03271 0.46292 2.60901 -1.37440 1.23461 1.72112 -1.95929 -0.23817
magnitude: 1.33988 au
magnitude: 3.40571 debye
