program: Orca
programVersion: 4.2.1
elementType: Cl Cl O N N N C C C C C C C C C C C C C C C H H H H H H H H H H H H H H H H H
charge: 0
multiplicity: 1
keywords: wb97x-d3
keywords: def2-TZVPP
keywords: def2/J RIJCOSX GRIDX6 NOFINALGRIDX
keywords: grid4 nofinalgrid
keywords: scfconv7
keywords: smallprint printgap noloewdin
keywords: NOSOSCF
formula: C15H17Cl2N3O
InChI: InChI=1/C15H17Cl2N3O/c1-15(2,3)14(21)13(20-9-18-8-19-20)6-10-4-5-11(16)7-12(10)17/h4-9,14,21H,1-3H3
38 atoms
Cl -1.254937 2.836931 0.307749
Cl -5.431361 -0.50542 0.026282
O  3.523138 -0.669224 -1.625939
N  1.263414 -1.264993 0.15556
N  0.567257 -1.253694 1.301513
N  1.352052 -3.308382 0.883874
C  3.665722 0.838988 0.244925
C  2.822456 0.352864 -0.956552
C  4.0527 -0.280848 1.213424
C  2.881551 1.911304 1.00114
C  4.946992 1.465672 -0.314814
C  1.417454 -0.084959 -0.613175
C  0.357428 0.641384 -0.9618
C  -1.052071 0.335525 -0.696705
C  1.729104 -2.502745 -0.076161
C  -1.897313 1.294741 -0.142205
C  -1.614277 -0.895649 -1.029613
C  0.64947 -2.494914 1.700176
C  -3.241604 1.052796 0.086695
C  -2.953191 -1.167514 -0.813778
C  -3.755951 -0.186372 -0.253778
H  2.702124 1.224589 -1.613683
H  4.753759 0.109378 1.954972
H  3.202349 -0.673051 1.771844
H  4.548521 -1.113253 0.71308
H  3.498585 2.33866 1.794065
H  1.980228 1.512395 1.469504
H  2.576561 2.73284 0.348141
H  5.57404 0.734473 -0.825774
H  5.541298 1.89694 0.493443
H  4.72638 2.269769 -1.021451
H  0.560433 1.572099 -1.480097
H  3.164003 -0.753579 -2.515357
H  2.314839 -2.765157 -0.940533
H  -0.996445 -1.656637 -1.487738
H  0.190049 -2.828058 2.617991
H  -3.870712 1.815035 0.52489
H  -3.362846 -2.130088 -1.086581
elementType: Cl O N C H
totalener: -1741.80010723 hartree
nucrepener: 1979.29266343 hartree
electener: -3721.09277066 hartree
oneelecener: -6321.14860266 hartree
twoeener: 2600.05583200 hartree
cpcmener: -0.02553489 hartree
kineticenergy: 1736.89844932 hartree
xcener: -122.673824077680 hartree
chargesum: 0.0000000
charge: -0.074501 -0.084777 -0.393303 0.125488 -0.326548 -0.382357 0.269393 0.168870 -0.368221 -0.344656 -0.336161 -0.142999 -0.037637 0.084409 0.080449 -0.016884 -0.169222 0.073728 -0.160483 -0.162773 0.111583 0.109014 0.105541 0.092941 0.104076 0.104942 0.086334 0.093339 0.099192 0.095692 0.095270 0.136432 0.217839 0.164181 0.150258 0.160141 0.125295 0.146116
qa: -0.0745 -0.0848 -0.3933 0.1255 -0.3265 -0.3824 0.2694 0.1689 -0.3682 -0.3447 -0.3362 -0.1430 -0.0376 0.0844 0.0804 -0.0169 -0.1692 0.0737 -0.1605 -0.1628 0.1116 0.1090 0.1055 0.0929 0.1041 0.1049 0.0863 0.0933 0.0992 0.0957 0.0953 0.1364 0.2178 0.1642 0.1503 0.1601 0.1253 0.1461
va: 1.2519 1.2190 2.0377 3.3833 2.8146 3.0516 3.6382 3.9259 3.9504 3.9404 3.9187 4.0188 3.8247 3.5338 4.0294 4.0309 3.9098 4.0168 4.0791 4.0189 3.8619 0.9968 1.0076 1.0058 1.0146 1.0068 1.0156 1.0093 1.0155 1.0061 1.0040 1.0116 1.0105 1.0232 1.0007 0.9961 1.0227 1.0052
dispcorr: -0.022732118 hartree
energy: -1741.822839347260
dipole: 43.95575 -43.41839 0.53736 0.93072 -0.16723 0.76349 0.21386 -1.97018 -1.75632
magnitude: 1.98905 au
magnitude: 5.05577 debye
