program: Orca
programVersion: 4.2.1
elementType: Cl Cl O N N N C C C C C C C C C C C C C C C H H H H H H H H H H H H H H H H H
charge: 0
multiplicity: 1
keywords: wb97x-d3
keywords: def2-TZVPP
keywords: def2/J RIJCOSX GRIDX6 NOFINALGRIDX
keywords: grid4 nofinalgrid
keywords: scfconv7
keywords: smallprint printgap noloewdin
keywords: NOSOSCF
formula: C15H17Cl2N3O
InChI: InChI=1/C15H17Cl2N3O/c1-15(2,3)14(21)13(20-9-18-8-19-20)6-10-4-5-11(16)7-12(10)17/h4-9,14,21H,1-3H3
38 atoms
Cl 1.298388 -2.236149 -1.431711
Cl 5.446151 0.594447 0.436197
O  -2.014579 2.110576 1.185321
N  -2.68589 -0.647226 0.66165
N  -2.910408 -1.915453 0.280189
N  -4.800201 -0.995355 1.05798
C  -1.654056 1.737163 -1.246604
C  -1.282142 1.385563 0.220426
C  -1.428439 3.242723 -1.428661
C  -3.096701 1.412971 -1.630832
C  -0.69891 0.989315 -2.176963
C  -1.389773 -0.078796 0.563322
C  -0.344606 -0.895988 0.698801
C  1.068264 -0.499724 0.622859
C  -3.83139 -0.118987 1.123533
C  1.926147 -1.082517 -0.307983
C  1.619066 0.424146 1.509848
C  -4.179847 -2.071114 0.535225
C  3.270415 -0.75723 -0.37974
C  2.957788 0.771774 1.462156
C  3.771576 0.175246 0.512841
H  -0.220083 1.639514 0.305859
H  -1.519957 3.510701 -2.482271
H  -2.164111 3.847725 -0.893445
H  -0.431701 3.548418 -1.100954
H  -3.296077 0.341504 -1.668118
H  -3.300256 1.801819 -2.630769
H  -3.818556 1.875594 -0.956194
H  -0.826719 -0.092195 -2.117487
H  0.346138 1.214679 -1.950996
H  -0.877958 1.282743 -3.21268
H  -0.532157 -1.951439 0.859618
H  -1.873871 3.050871 1.031521
H  -3.915003 0.883371 1.502066
H  0.98521 0.875034 2.262142
H  -4.684163 -3.002483 0.331681
H  3.909708 -1.220384 -1.118093
H  3.357369 1.492429 2.161387
elementType: Cl O N C H
totalener: -1741.78791376 hartree
nucrepener: 1979.42782695 hartree
electener: -3721.21574072 hartree
oneelecener: -6321.04118632 hartree
twoeener: 2599.82544560 hartree
cpcmener: -0.02595483 hartree
kineticenergy: 1736.91632770 hartree
xcener: -122.682284272067 hartree
chargesum: -0.0000000
charge: -0.075899 -0.085565 -0.416146 0.125635 -0.340611 -0.405845 0.272775 0.084756 -0.351838 -0.369363 -0.375198 -0.036746 -0.028818 0.006658 0.070226 0.012793 -0.131680 0.074885 -0.154603 -0.180038 0.115186 0.119166 0.097918 0.095899 0.113964 0.094677 0.109715 0.103238 0.091113 0.101178 0.109103 0.132716 0.230204 0.187440 0.161487 0.164509 0.128134 0.148976
qa: -0.0759 -0.0856 -0.4161 0.1256 -0.3406 -0.4058 0.2728 0.0848 -0.3518 -0.3694 -0.3752 -0.0367 -0.0288 0.0067 0.0702 0.0128 -0.1317 0.0749 -0.1546 -0.1800 0.1152 0.1192 0.0979 0.0959 0.1140 0.0947 0.1097 0.1032 0.0911 0.1012 0.1091 0.1327 0.2302 0.1874 0.1615 0.1645 0.1281 0.1490
va: 1.2498 1.2186 1.9868 3.4169 2.8517 3.0313 3.6604 3.9938 3.9362 3.9532 3.9604 3.8171 3.8170 3.5947 4.0127 3.9155 3.8606 4.0334 4.0823 4.0321 3.8636 1.0167 1.0057 1.0079 0.9978 0.9999 1.0084 1.0085 1.0073 1.0014 1.0099 1.0390 1.0120 1.0167 0.9993 0.9934 1.0217 1.0039
dispcorr: -0.022865711 hartree
energy: -1741.810779472776
dipole: -26.94566 27.95779 1.01214 20.10614 -18.12068 1.98546 -7.83060 7.72744 -0.10316
magnitude: 2.23094 au
magnitude: 5.67060 debye
