program: Orca
programVersion: 4.2.1
elementType: Cl Cl O N N N C C C C C C C C C C C C C C C H H H H H H H H H H H H H H H H H
charge: 0
multiplicity: 1
keywords: wb97x-d3
keywords: def2-TZVPP
keywords: def2/J RIJCOSX GRIDX6 NOFINALGRIDX
keywords: grid4 nofinalgrid
keywords: scfconv7
keywords: smallprint printgap noloewdin
keywords: NOSOSCF
formula: C15H17Cl2N3O
InChI: InChI=1/C15H17Cl2N3O/c1-15(2,3)14(21)13(20-9-18-8-19-20)6-10-4-5-11(16)7-12(10)17/h4-9,14,21H,1-3H3
38 atoms
Cl 1.298502 -2.286893 -1.387576
Cl 5.446312 0.625132 0.358249
O  -1.987445 2.116002 1.209557
N  -2.658488 -0.70173 0.626376
N  -3.688562 -0.05861 1.192937
N  -4.344488 -2.057301 0.446701
C  -1.688625 1.734155 -1.221316
C  -1.307448 1.359945 0.236796
C  -1.390371 3.22673 -1.393573
C  -3.157492 1.491598 -1.568913
C  -0.800232 0.942784 -2.181574
C  -1.369593 -0.120635 0.553524
C  -0.321942 -0.923262 0.737453
C  1.088186 -0.51766 0.639917
C  -3.073437 -1.897027 0.181364
C  1.935662 -1.107452 -0.295472
C  1.640672 0.427753 1.50162
C  -4.675077 -0.906858 1.064741
C  3.274268 -0.767801 -0.395622
C  2.974407 0.789802 1.424518
C  3.779166 0.186639 0.471837
H  -0.256335 1.640957 0.331547
H  -2.02705 3.848116 -0.763065
H  -0.351381 3.461589 -1.150499
H  -1.558732 3.531149 -2.428298
H  -3.424168 0.434536 -1.597048
H  -3.365357 1.88732 -2.565616
H  -3.837347 1.997668 -0.881629
H  -0.99143 -0.130924 -2.140899
H  0.261689 1.099095 -1.974788
H  -0.978036 1.261645 -3.210722
H  -0.495444 -1.969985 0.968781
H  -2.870978 1.737526 1.333322
H  -2.430284 -2.588872 -0.339261
H  1.013669 0.884622 2.256529
H  -5.666346 -0.688085 1.429296
H  3.906817 -1.235827 -1.137027
H  3.377129 1.528137 2.103834
elementType: Cl O N C H
totalener: -1741.80093218 hartree
nucrepener: 1980.16795645 hartree
electener: -3721.96888863 hartree
oneelecener: -6322.01332247 hartree
twoeener: 2600.04443385 hartree
cpcmener: -0.02052862 hartree
kineticenergy: 1736.90100042 hartree
xcener: -122.680992323913 hartree
chargesum: -0.0000000
charge: -0.073780 -0.082220 -0.440742 0.146143 -0.367941 -0.391348 0.262100 0.164151 -0.342719 -0.361984 -0.367355 -0.087228 -0.053961 0.004165 0.080614 0.010756 -0.124878 0.096504 -0.157312 -0.179502 0.116701 0.101892 0.097394 0.096669 0.096790 0.097376 0.103915 0.097641 0.090540 0.099111 0.106896 0.156537 0.230314 0.170299 0.161595 0.167430 0.127953 0.147484
qa: -0.0738 -0.0822 -0.4407 0.1461 -0.3679 -0.3913 0.2621 0.1642 -0.3427 -0.3620 -0.3674 -0.0872 -0.0540 0.0042 0.0806 0.0108 -0.1249 0.0965 -0.1573 -0.1795 0.1167 0.1019 0.0974 0.0967 0.0968 0.0974 0.1039 0.0976 0.0905 0.0991 0.1069 0.1565 0.2303 0.1703 0.1616 0.1674 0.1280 0.1475
va: 1.2513 1.2219 1.9762 3.3630 2.8542 3.0494 3.6834 3.9867 3.9293 3.9554 3.9587 3.8742 3.8320 3.5864 4.0543 3.9247 3.8593 3.9977 4.0808 4.0340 3.8700 1.0183 1.0182 1.0012 1.0060 0.9983 1.0087 1.0138 1.0042 1.0019 1.0102 0.9971 1.0534 0.9963 1.0000 0.9917 1.0213 1.0045
dispcorr: -0.023081171 hartree
energy: -1741.824013350769
dipole: -27.64102 28.16158 0.52056 17.93807 -18.16773 -0.22966 -7.82389 7.56939 -0.25450
magnitude: 0.62329 au
magnitude: 1.58428 debye
