program: Orca
programVersion: 4.2.1
elementType: Cl Cl O O O N N N C C C C C C C C C C C C C C C C C C C H H H H H H H H H H H H H H H H H
charge: 0
multiplicity: 1
keywords: wb97x-d3
keywords: def2-TZVPP
keywords: def2/J RIJCOSX GRIDX6 NOFINALGRIDX
keywords: grid4 nofinalgrid
keywords: scfconv7
keywords: smallprint printgap noloewdin
keywords: NOSOSCF
formula: C19H17Cl2N3O3
InChI: InChI=1/C19H17Cl2N3O3/c1-13-9-25-19(27-13,10-24-12-22-11-23-24)17-7-6-16(8-18(17)21)26-15-4-2-14(20)3-5-15/h2-8,11-13H,9-10H2,1H3
44 atoms
Cl 0.113868 -0.802004 1.982523
Cl -7.385376 2.41338 0.930577
O  3.410232 -0.180948 -1.055772
O  2.80111 0.171028 1.062946
O  -2.777827 0.326995 -2.022941
N  4.063164 -2.347845 0.608202
N  4.988526 -2.742676 -0.270423
N  5.904327 -2.455433 1.75843
C  2.495827 -0.579275 -0.073654
C  4.000664 1.068735 -0.684494
C  2.70729 -2.066506 0.2166
C  3.231481 1.432545 0.582495
C  1.062705 -0.328791 -0.541754
C  5.488834 0.901244 -0.471767
C  -0.045313 -0.408886 0.30017
C  0.813185 -0.013736 -1.874801
C  -1.33797 -0.1919 -0.152664
C  -0.461418 0.230365 -2.350988
C  -1.539551 0.138146 -1.484941
C  4.626215 -2.167739 1.803495
C  6.066917 -2.795207 0.465388
C  -3.814997 0.813122 -1.268371
C  -5.058437 0.230994 -1.460127
C  -3.663499 1.8896 -0.40458
C  -6.163842 0.728165 -0.788271
C  -4.765942 2.377454 0.278915
C  -6.00811 1.794777 0.082031
H  3.814413 1.795125 -1.479179
H  2.481014 -2.649799 -0.673715
H  2.038449 -2.403745 1.005827
H  3.848208 1.906764 1.345105
H  2.378259 2.085266 0.368084
H  5.969161 0.480979 -1.355352
H  5.944005 1.873171 -0.278537
H  5.705219 0.253011 0.378822
H  1.639364 0.055077 -2.567239
H  -2.168456 -0.28595 0.534081
H  -0.6174 0.483545 -3.391076
H  4.0731 -1.85845 2.675432
H  7.015978 -3.098303 0.052214
H  -5.169026 -0.604199 -2.138817
H  -2.701253 2.363199 -0.260372
H  -7.133746 0.276258 -0.942626
H  -4.649309 3.215825 0.951441
elementType: Cl O N C H
totalener: -2044.68957025 hartree
nucrepener: 2707.82505281 hartree
electener: -4752.51462306 hartree
oneelecener: -8185.99792628 hartree
twoeener: 3433.48330322 hartree
cpcmener: -0.03351872 hartree
kineticenergy: 2038.70516160 hartree
xcener: -149.989398895808 hartree
chargesum: 0.0000000
charge: -0.081686 -0.100958 -0.406309 -0.368574 -0.327837 0.136501 -0.346760 -0.415661 0.592304 0.156339 -0.138944 0.017112 -0.182010 -0.304572 0.025643 -0.087332 -0.195958 -0.283323 0.301437 0.062066 0.050935 0.306972 -0.263582 -0.212248 -0.104250 -0.124101 0.061992 0.087453 0.133868 0.152865 0.111605 0.094498 0.093854 0.108361 0.078953 0.150404 0.134752 0.150390 0.163428 0.160712 0.152693 0.161970 0.148490 0.148510
qa: -0.0817 -0.1010 -0.4063 -0.3686 -0.3278 0.1365 -0.3468 -0.4157 0.5923 0.1563 -0.1389 0.0171 -0.1820 -0.3046 0.0256 -0.0873 -0.1960 -0.2833 0.3014 0.0621 0.0509 0.3070 -0.2636 -0.2122 -0.1042 -0.1241 0.0620 0.0875 0.1339 0.1529 0.1116 0.0945 0.0939 0.1084 0.0790 0.1504 0.1348 0.1504 0.1634 0.1607 0.1527 0.1620 0.1485 0.1485
va: 1.2412 1.2026 1.9834 1.9866 2.0840 3.3631 2.8886 3.0113 3.8540 3.8793 3.7888 3.9232 3.6055 3.9744 3.9835 3.9014 4.0028 4.0798 3.7608 4.0626 4.0499 3.6698 4.0524 3.9681 3.9436 3.9590 3.8414 0.9988 1.0219 1.0160 0.9953 1.0041 1.0087 1.0079 1.0049 1.0225 1.0224 1.0085 1.0072 0.9974 1.0050 0.9928 1.0010 1.0025
dispcorr: -0.024893704 hartree
energy: -2044.714463951878
dipole: 30.94389 -31.93204 -0.98815 1.54305 -0.15250 1.39055 -9.36523 8.61641 -0.74882
magnitude: 1.86301 au
magnitude: 4.73539 debye
