program: Orca
programVersion: 5.0.4
elementType: C C C C C N C C C C H H H C N C C H C O C O N N C H H H C H H H C H H H C H H H Gd N O O O N O O O N O O O C N C N
elementType: Gd
keywords: def2-SVPD def2/JK def2/J def2-SVPD/C PBE rijcosx rhf hcore XYZFile VeryTightSCF freq cpcm(water) D3 defgrid3
charge: 0
multiplicity: 1
frequency: 0.00 0.00 0.00 0.00 0.00 0.00 18.61 24.17 29.63 32.40 36.06 41.30 48.38 51.34 68.19 70.21 74.97 77.16 87.52 91.17 95.17 96.88 97.10 100.93 108.55 111.60 115.08 122.57 124.89 134.50 142.90 157.05 165.52 170.56 171.69 174.80 180.11 186.87 187.88 191.63 198.02 204.54 211.00 220.04 235.15 248.15 257.76 276.27 289.04 300.11 311.80 323.44 335.82 360.37 366.33 394.56 413.49 419.42 422.27 430.51 451.20 467.71 491.53 503.49 549.26 552.99 580.12 602.71 613.54 634.03 647.26 656.64 669.47 701.58 703.40 703.55 707.46 722.39 726.82 732.46 733.77 737.52 741.89 758.47 766.34 797.63 797.74 799.30 840.11 852.75 873.11 877.45 895.07 900.24 903.36 953.36 973.52 975.95 989.04 1044.74 1047.54 1052.23 1055.04 1056.99 1071.02 1072.26 1111.22 1116.82 1121.24 1130.69 1145.42 1151.42 1179.84 1199.84 1241.23 1242.20 1251.29 1267.64 1271.37 1279.60 1289.84 1322.44 1335.84 1353.29 1357.74 1375.64 1377.46 1381.01 1383.84 1393.46 1395.24 1396.47 1399.75 1405.26 1411.90 1412.88 1415.35 1421.48 1424.21 1451.16 1469.07 1474.09 1475.86 1480.28 1495.47 1502.48 1503.00 1553.65 1569.42 1593.72 1616.12 1620.69 1628.40 2277.67 2278.02 2978.36 2978.95 2981.83 2982.62 3062.30 3065.21 3068.46 3069.20 3110.03 3110.49 3121.03 3122.99 3130.05 3141.21 3165.41 3172.37
frequency: 18.61 24.17 29.63 32.40 36.06 41.30 48.38 51.34 68.19 70.21 74.97 77.16 87.52 91.17 95.17 96.88 97.10 100.93 108.55 111.60 115.08 122.57 124.89 134.50 142.90 157.05 165.52 170.56 171.69 174.80 180.11 186.87 187.88 191.63 198.02 204.54 211.00 220.04 235.15 248.15 257.76 276.27 289.04 300.11 311.80 323.44 335.82 360.37 366.33 394.56 413.49 419.42 422.27 430.51 451.20 467.71 491.53 503.49 549.26 552.99 580.12 602.71 613.54 634.03 647.26 656.64 669.47 701.58 703.40 703.55 707.46 722.39 726.82 732.46 733.77 737.52 741.89 758.47 766.34 797.63 797.74 799.30 840.11 852.75 873.11 877.45 895.07 900.24 903.36 953.36 973.52 975.95 989.04 1044.74 1047.54 1052.23 1055.04 1056.99 1071.02 1072.26 1111.22 1116.82 1121.24 1130.69 1145.42 1151.42 1179.84 1199.84 1241.23 1242.20 1251.29 1267.64 1271.37 1279.60 1289.84 1322.44 1335.84 1353.29 1357.74 1375.64 1377.46 1381.01 1383.84 1393.46 1395.24 1396.47 1399.75 1405.26 1411.90 1412.88 1415.35 1421.48 1424.21 1451.16 1469.07 1474.09 1475.86 1480.28 1495.47 1502.48 1503.00 1553.65 1569.42 1593.72 1616.12 1620.69 1628.40 2277.67 2278.02 2978.36 2978.95 2981.83 2982.62 3062.30 3065.21 3068.46 3069.20 3110.03 3110.49 3121.03 3122.99 3130.05 3141.21 3165.41 3172.37
formula: C20H16GdN9O11
InChI: InChI=1/C20H16N6O2.Gd.3NO3/c1-25(2)19(27)15-7-11(9-21)13-5-6-14-12(10-22)8-16(20(28)26(3)4)24-18(14)17(13)23-15;;3*2-1(3)4/h5-8H,1-4H3;;;;/q-4;+10;3*-2/rC20H16GdN9O11/c1-24(2)19-15-7-11(9-22)13-5-6-14-12(10-23)8-16-20(25(3)4)35-21(34-19,36-28(31)37-21,38-29(32)39-21,40-30(33)41-21)26(15)17(13)18(14)27(16)21/h5-8H,1-4H3
57 atoms
C  -0.414825 -0.44596 -4.067069
C  -0.529658 0.930735 -4.292379
C  -0.37513 -0.95427 -2.731623
C  -0.627897 1.795434 -3.180645
C  -0.454393 0.015235 -1.688384
N  -0.585012 1.335219 -1.925309
C  -0.223057 -2.340586 -2.397352
C  -0.109064 -2.74543 -1.086844
C  -0.138637 -1.792679 -0.015891
C  -0.332892 -0.410822 -0.308402
H  -0.5049 1.319963 -5.315674
H  -0.182837 -3.083701 -3.204859
H  0.021442 -3.810216 -0.852824
C  0.055309 -2.11835 1.362186
N  -0.368115 0.541609 0.641123
C  -0.240815 0.217454 1.931093
C  0.007919 -1.114155 2.335933
H  0.198332 -1.369696 3.382486
C  -0.602174 3.305398 -3.23981
O  -0.000145 3.884232 -2.289225
C  -0.2655 1.435129 2.826978
O  0.048396 2.534176 2.283942
N  -1.168219 3.978762 -4.247806
N  -0.594876 1.358006 4.123581
C  -2.113973 3.415097 -5.210403
H  -1.642485 3.298972 -6.204941
H  -2.511765 2.450841 -4.859597
H  -2.960705 4.118394 -5.302986
C  -0.989481 5.428172 -4.315065
H  -0.068259 5.715389 -3.786452
H  -0.926765 5.721433 -5.377386
H  -1.855693 5.939266 -3.851289
C  -1.241769 0.216631 4.770944
H  -1.753164 -0.421434 4.034109
H  -0.512346 -0.375499 5.356391
H  -2.005409 0.612574 5.462971
C  -0.450685 2.550414 4.958272
H  -1.427974 3.060449 5.064251
H  -0.102753 2.233518 5.957192
H  0.275852 3.240048 4.503853
Gd -0.485139 3.087101 -0.020972
N  2.465819 3.235054 0.030762
O  3.693788 3.297805 0.066515
O  1.727042 4.224896 0.368685
O  1.854007 2.176264 -0.347022
N  -3.380663 2.649335 -0.557561
O  -4.58374 2.502602 -0.772701
O  -2.677088 3.49564 -1.213509
O  -2.76191 1.967231 0.32728
N  -1.677551 5.654993 0.922226
O  -2.201914 6.710005 1.285041
O  -1.955479 4.537296 1.479032
O  -0.827625 5.615077 -0.031138
C  -0.306129 -1.341192 -5.181684
N  -0.22125 -2.078726 -6.087975
C  0.316115 -3.47349 1.750641
N  0.526134 -4.583838 2.059908
elementType: C N H O Gd
totalener: -2124.29652579 hartree
nucrepener: 5239.78687974 hartree
electener: -7364.08340553 hartree
twoeener: 5982.07352835 hartree
cpcmener: -0.09757247 hartree
kineticenergy: 2079.21290771 hartree
exchangeener: -262.626895689839 hartree
correlationener: -10.175572024991 hartree
xcener: -272.802467714830 hartree
chargesum: -0.0000000
charge: 0.081592 0.006042 -0.283920 -0.199134 -0.316732 0.024648 -0.526118 -0.534196 -0.357463 0.025735 -0.108470 0.737769 0.782426 0.043402 -0.170183 -0.151284 -0.034150 -0.124267 0.846106 -1.063622 0.852998 -1.096856 -1.457489 -1.363056 0.938608 0.108091 -0.035025 -0.145775 1.061046 -0.104830 -0.072291 0.066105 0.869400 0.034082 0.141770 -0.218437 1.017247 0.045942 -0.029383 -0.125957 3.649950 0.551352 -0.426486 -0.607652 -0.624341 0.534108 -0.436043 -0.556038 -0.559696 0.563477 -0.444999 -0.595640 -0.539586 0.268814 -0.101597 0.262020 -0.102015
charge: -0.099109 0.153474 -0.031059 0.002923 0.016154 -0.023507 0.100826 0.100822 -0.030893 0.011617 0.045629 0.036446 0.036355 -0.100145 -0.029035 0.009956 0.153541 0.037753 -0.045099 -0.301429 -0.012058 -0.308185 -0.196999 -0.198503 0.246219 0.027478 0.008442 0.024066 0.253456 0.005404 0.023051 0.031523 0.244581 0.010309 0.028099 0.022523 0.251611 0.031469 0.024244 0.003523 1.649416 -0.369566 -0.034134 -0.172386 -0.174676 -0.362585 -0.036505 -0.167306 -0.171615 -0.373411 -0.045771 -0.165375 -0.168437 -0.054099 0.068815 -0.055263 0.067424
qa: 0.0816 0.0060 -0.2839 -0.1991 -0.3167 0.0246 -0.5261 -0.5342 -0.3575 0.0257 -0.1085 0.7378 0.7824 0.0434 -0.1702 -0.1513 -0.0341 -0.1243 0.8461 -1.0636 0.8530 -1.0969 -1.4575 -1.3631 0.9386 0.1081 -0.0350 -0.1458 1.0610 -0.1048 -0.0723 0.0661 0.8694 0.0341 0.1418 -0.2184 1.0172 0.0459 -0.0294 -0.1260 3.6499 0.5514 -0.4265 -0.6077 -0.6243 0.5341 -0.4360 -0.5560 -0.5597 0.5635 -0.4450 -0.5956 -0.5396 0.2688 -0.1016 0.2620 -0.1020
va: 4.6740 4.2930 4.7941 4.4962 5.3814 4.7332 4.9065 4.8458 5.0060 4.9696 1.4603 0.8548 0.7899 4.5115 4.9741 4.4065 4.4674 1.5217 3.1624 1.5172 2.9413 1.5822 5.5791 5.4558 3.7345 0.8304 1.0676 0.9192 3.5733 1.1124 0.9049 0.8465 3.7986 0.9950 0.8171 0.9643 3.5893 0.8599 0.9027 1.1355 -1.8630 4.0542 1.7932 1.4989 1.5772 4.1056 1.7967 1.2216 1.4986 4.0570 1.7753 1.3920 1.4411 4.0554 2.5431 4.0691 2.5452
dispersion: -0.090686198 hartree
energy: -2124.387211985684 hartree
dipole: -15.07499 14.47237 -0.60261 -151.35461 145.93546 -5.41915 -45.06402 44.03876 -1.02526
magnitude: 5.54811 au
magnitude: 14.10217 debye
temp: 298.15 k
press: 1.00 atm
zeropoint: 0.37362412 hartree
thermalvibcorrection: 0.03816758 hartree
thermalrotcorrection: 0.00141627 hartree
thermaltrasncorrection: 0.00141627 hartree
thermaltotal: -2123.97258774 hartree
thermalcorr: 0.04100013 hartree
nonthermalcorr: 0.37362412 hartree
totalcorr: 0.41462424 hartree
thermalcorrenthalpy: 0.00094421 hartree
totalenthalpy: -2123.97164353 hartree
vibrat: 0.07067409 hartree
rotat: 0.01794481 hartree
transl: 0.02165849 hartree
total: 0.11027740 hartree
totalentropycorr: -0.11027740 hartree
gibbsenthalpy: -2124.08192093 hartree
gibbsminuselec: 0.30529105 hartree
