program: Orca
programVersion: 4.2.1
elementType: Cl Cl O O O N N N C C C C C C C C C C C C C C C C C C C H H H H H H H H H H H H H H H H H
charge: 0
multiplicity: 1
keywords: wb97x-d3
keywords: def2-TZVPP
keywords: def2/J RIJCOSX GRIDX6 NOFINALGRIDX
keywords: grid4 nofinalgrid
keywords: scfconv7
keywords: smallprint printgap noloewdin
keywords: NOSOSCF
formula: C19H17Cl2N3O3
InChI: InChI=1/C19H17Cl2N3O3/c1-13-9-25-19(27-13,10-24-12-22-11-23-24)17-7-6-16(8-18(17)21)26-15-4-2-14(20)3-5-15/h2-8,11-13H,9-10H2,1H3
44 atoms
Cl 1.436383 0.572929 3.020953
Cl -7.089085 1.990309 -3.008246
O  2.638532 -0.853292 -1.08851
O  3.21049 0.380457 0.671287
O  -3.13607 0.550878 1.066572
N  4.103177 -2.294764 0.901386
N  5.008102 -1.923313 1.81027
N  5.999954 -2.996852 0.107273
C  2.371296 -0.656684 0.272513
C  3.184062 0.350955 -1.637897
C  2.713952 -1.94335 1.022449
C  3.24203 1.278984 -0.42187
C  0.897684 -0.314261 0.487105
C  4.534024 0.070045 -2.257882
C  0.406645 0.242284 1.667591
C  -0.032991 -0.590279 -0.510379
C  -0.933295 0.550799 1.829373
C  -1.382398 -0.314225 -0.368759
C  -1.826861 0.273107 0.806353
C  4.709728 -2.918452 -0.109232
C  6.121787 -2.368831 1.292359
C  -4.007833 0.875556 0.059533
C  -3.666796 1.737246 -0.974473
C  -5.292136 0.361213 0.155361
C  -4.618018 2.074531 -1.924228
C  -6.247289 0.709811 -0.785806
C  -5.901202 1.559951 -1.823828
H  2.497896 0.741259 -2.393753
H  2.106946 -2.755031 0.622732
H  2.478769 -1.853186 2.080254
H  4.159642 1.86386 -0.367784
H  2.390901 1.967624 -0.394575
H  5.267214 -0.226307 -1.505971
H  4.470502 -0.718482 -3.008061
H  4.904525 0.967884 -2.753642
H  0.300117 -1.04486 -1.432441
H  -1.28786 0.99683 2.748969
H  -2.064886 -0.563555 -1.169968
H  4.179929 -3.315215 -0.959755
H  7.067261 -2.243325 1.796259
H  -2.672439 2.157331 -1.051027
H  -5.551178 -0.303634 0.968787
H  -4.353386 2.743666 -2.731153
H  -7.249722 0.31262 -0.706408
elementType: Cl O N C H
totalener: -2044.68966158 hartree
nucrepener: 2694.11723404 hartree
electener: -4738.80689562 hartree
oneelecener: -8158.60978951 hartree
twoeener: 3419.80289389 hartree
cpcmener: -0.03594999 hartree
kineticenergy: 2038.70995849 hartree
xcener: -149.989417289365 hartree
chargesum: 0.0000000
charge: -0.080753 -0.101271 -0.412065 -0.358278 -0.329464 0.139682 -0.352900 -0.419480 0.593244 0.150314 -0.105545 0.013736 -0.187228 -0.298568 0.038252 -0.111870 -0.243476 -0.242611 0.301734 0.048451 0.056707 0.319629 -0.221598 -0.265669 -0.122522 -0.103974 0.059842 0.086478 0.144965 0.132769 0.109415 0.092115 0.081452 0.096497 0.108872 0.151998 0.129368 0.159201 0.169512 0.162094 0.161246 0.152027 0.149125 0.148549
qa: -0.0808 -0.1013 -0.4121 -0.3583 -0.3295 0.1397 -0.3529 -0.4195 0.5932 0.1503 -0.1055 0.0137 -0.1872 -0.2986 0.0383 -0.1119 -0.2435 -0.2426 0.3017 0.0485 0.0567 0.3196 -0.2216 -0.2657 -0.1225 -0.1040 0.0598 0.0865 0.1450 0.1328 0.1094 0.0921 0.0815 0.0965 0.1089 0.1520 0.1294 0.1592 0.1695 0.1621 0.1612 0.1520 0.1491 0.1485
va: 1.2388 1.2026 1.9712 1.9996 2.0824 3.3578 2.8871 3.0085 3.8650 3.8659 3.7722 3.9322 3.6205 3.9663 3.9519 3.9409 4.1352 3.9947 3.7608 4.0700 4.0515 3.6569 3.9698 4.0489 3.9563 3.9423 3.8427 1.0010 1.0043 1.0321 0.9958 1.0025 1.0032 1.0070 1.0050 1.0236 1.0283 0.9968 1.0036 0.9952 0.9940 1.0055 1.0022 1.0011
dispcorr: -0.024448867 hartree
energy: -2044.714110451554
dipole: 23.23889 -24.83916 -1.60027 -4.72308 5.27450 0.55141 -9.65758 8.19808 -1.45950
magnitude: 2.23496 au
magnitude: 5.68082 debye
