program: Orca
programVersion: 5.0.4
elementType: C C C C C N C C C C H H H C N C C H C O C O N N C H H H C H H H C H H H C H H H Ce N O O O N O O O N O O O C N C N
elementType: Ce
keywords: def2-SVPD def2/JK def2/J def2-SVPD/C PBE rijcosx rhf hcore XYZFile VeryTightSCF freq cpcm(water) D3 defgrid3
charge: 0
multiplicity: 1
frequency: 0.00 0.00 0.00 0.00 0.00 0.00 13.82 19.78 27.48 30.37 32.50 36.67 40.70 43.12 65.13 67.15 69.84 74.20 78.23 80.27 82.65 91.19 93.25 96.37 100.23 103.29 104.99 110.98 115.01 120.29 129.81 141.28 157.44 166.98 169.55 171.12 176.67 178.93 180.45 190.49 197.79 203.23 204.82 208.34 231.70 243.22 256.58 275.56 288.30 298.16 309.05 324.71 336.62 358.87 365.88 391.79 410.10 415.78 420.79 424.61 449.68 468.11 486.24 497.25 551.70 554.91 577.92 601.24 615.42 636.85 647.74 654.37 670.04 703.19 704.37 704.66 705.71 722.42 727.73 728.25 730.90 732.18 735.41 759.89 766.55 798.70 798.76 799.96 841.10 859.30 872.66 877.04 898.99 900.00 907.03 952.24 975.33 975.87 987.73 1044.89 1046.33 1049.71 1052.46 1054.10 1072.23 1072.81 1109.65 1117.21 1121.27 1129.28 1146.16 1150.42 1180.42 1199.95 1240.73 1241.91 1250.51 1264.12 1267.77 1273.92 1279.21 1320.08 1334.33 1352.83 1355.99 1376.01 1377.08 1381.32 1382.74 1392.07 1394.02 1395.59 1396.85 1402.65 1410.77 1411.64 1412.80 1421.30 1422.64 1449.05 1463.79 1472.60 1474.98 1476.14 1489.23 1502.00 1503.57 1551.83 1568.63 1592.39 1616.43 1618.96 1626.18 2277.70 2278.01 2978.21 2979.05 2981.65 2982.65 3061.79 3063.79 3067.89 3068.58 3109.21 3111.05 3121.11 3121.34 3130.09 3141.24 3164.87 3166.48
frequency: 13.82 19.78 27.48 30.37 32.50 36.67 40.70 43.12 65.13 67.15 69.84 74.20 78.23 80.27 82.65 91.19 93.25 96.37 100.23 103.29 104.99 110.98 115.01 120.29 129.81 141.28 157.44 166.98 169.55 171.12 176.67 178.93 180.45 190.49 197.79 203.23 204.82 208.34 231.70 243.22 256.58 275.56 288.30 298.16 309.05 324.71 336.62 358.87 365.88 391.79 410.10 415.78 420.79 424.61 449.68 468.11 486.24 497.25 551.70 554.91 577.92 601.24 615.42 636.85 647.74 654.37 670.04 703.19 704.37 704.66 705.71 722.42 727.73 728.25 730.90 732.18 735.41 759.89 766.55 798.70 798.76 799.96 841.10 859.30 872.66 877.04 898.99 900.00 907.03 952.24 975.33 975.87 987.73 1044.89 1046.33 1049.71 1052.46 1054.10 1072.23 1072.81 1109.65 1117.21 1121.27 1129.28 1146.16 1150.42 1180.42 1199.95 1240.73 1241.91 1250.51 1264.12 1267.77 1273.92 1279.21 1320.08 1334.33 1352.83 1355.99 1376.01 1377.08 1381.32 1382.74 1392.07 1394.02 1395.59 1396.85 1402.65 1410.77 1411.64 1412.80 1421.30 1422.64 1449.05 1463.79 1472.60 1474.98 1476.14 1489.23 1502.00 1503.57 1551.83 1568.63 1592.39 1616.43 1618.96 1626.18 2277.70 2278.01 2978.21 2979.05 2981.65 2982.65 3061.79 3063.79 3067.89 3068.58 3109.21 3111.05 3121.11 3121.34 3130.09 3141.24 3164.87 3166.48
formula: C20H16CeN9O11
InChI: InChI=1/C20H16N6O2.Ce.3NO3/c1-25(2)19(27)15-7-11(9-21)13-5-6-14-12(10-22)8-16(20(28)26(3)4)24-18(14)17(13)23-15;;3*2-1(3)4/h5-8H,1-4H3;;;;/q-4;+10;3*-2/rC20H16CeN9O11/c1-24(2)19-15-7-11(9-22)13-5-6-14-12(10-23)8-16-20(25(3)4)35-21(34-19,36-28(31)37-21,38-29(32)39-21,40-30(33)41-21)26(15)17(13)18(14)27(16)21/h5-8H,1-4H3
57 atoms
C  -0.385417 -0.45304 -4.073969
C  -0.5251 0.919456 -4.305164
C  -0.313996 -0.952188 -2.736197
C  -0.603613 1.789067 -3.195796
C  -0.381763 0.021577 -1.694373
N  -0.521415 1.340488 -1.938543
C  -0.150848 -2.337126 -2.403833
C  -0.030983 -2.741651 -1.09441
C  -0.067606 -1.790018 -0.023307
C  -0.258409 -0.405584 -0.312586
H  -0.538677 1.305128 -5.330228
H  -0.111798 -3.079773 -3.211795
H  0.103128 -3.806046 -0.860678
C  0.108596 -2.126314 1.354978
N  -0.304999 0.540326 0.64509
C  -0.202341 0.202261 1.933728
C  0.040934 -1.13087 2.335354
H  0.208429 -1.389913 3.385883
C  -0.614049 3.298333 -3.283887
O  0.04216 3.913746 -2.394501
C  -0.249843 1.398785 2.856893
O  0.155535 2.498379 2.37993
N  -1.273543 3.932129 -4.260646
N  -0.701135 1.29481 4.11403
C  -2.265296 3.317589 -5.142319
H  -1.862819 3.201983 -6.16676
H  -2.598497 2.344686 -4.750317
H  -3.143243 3.986855 -5.182319
C  -1.147545 5.384333 -4.370348
H  -0.20628 5.71307 -3.905098
H  -1.15926 5.655208 -5.440536
H  -2.000905 5.877747 -3.865466
C  -1.457689 0.164904 4.653537
H  -1.868701 -0.460265 3.846667
H  -0.829881 -0.444485 5.3313
H  -2.304756 0.573799 5.232542
C  -0.593981 2.454965 4.997807
H  -1.548499 3.016548 5.006245
H  -0.382615 2.093268 6.019271
H  0.216541 3.11448 4.653345
Ce -0.343767 3.1877 0.007445
N  2.710383 3.210693 0.017558
O  3.940807 3.217119 0.042642
O  2.025038 4.235731 0.365808
O  2.051384 2.179571 -0.357858
N  -3.349662 2.774919 -0.454199
O  -4.561709 2.641088 -0.629386
O  -2.654122 3.578038 -1.169961
O  -2.723079 2.119719 0.445908
N  -1.472694 5.89168 0.938472
O  -1.955943 6.970944 1.287719
O  -1.778916 4.797653 1.527292
O  -0.642068 5.809711 -0.03057
C  0.366063 -3.484136 1.736321
N  0.573448 -4.596223 2.04107
C  -0.292144 -1.354716 -5.184837
N  -0.21993 -2.096628 -6.088655
elementType: C N H O Ce
totalener: -2120.63406369 hartree
nucrepener: 5177.78714601 hartree
electener: -7298.42120970 hartree
twoeener: 5917.39109995 hartree
cpcmener: -0.09738078 hartree
kineticenergy: 2077.29099607 hartree
exchangeener: -262.225361341911 hartree
correlationener: -10.162338536744 hartree
xcener: -272.387699878655 hartree
chargesum: -0.0000000
charge: 0.094653 0.108180 -0.294227 -0.212552 -0.279376 0.053667 -0.518971 -0.524756 -0.326746 -0.063356 -0.152176 0.773451 0.808703 0.045772 -0.192460 -0.159296 0.080216 -0.130806 0.697238 -1.009820 0.740340 -1.074494 -1.465836 -1.379040 0.938340 0.099707 -0.027431 -0.133082 1.064421 -0.108419 -0.060390 0.058748 0.897714 -0.002371 0.107511 -0.167293 1.022619 0.051681 -0.044162 -0.113119 3.787832 0.507082 -0.416554 -0.615555 -0.636230 0.494710 -0.434619 -0.571011 -0.560296 0.509915 -0.439904 -0.605351 -0.570786 0.273168 -0.101556 0.279058 -0.102684
charge: -0.100043 0.151055 -0.032569 -0.006329 0.011327 -0.030749 0.099622 0.099640 -0.032332 0.007842 0.047182 0.036193 0.036127 -0.101031 -0.033875 -0.002625 0.150114 0.043706 -0.057695 -0.322202 -0.028763 -0.327199 -0.198956 -0.200673 0.245682 0.027236 0.008425 0.024012 0.252867 0.004159 0.023122 0.030730 0.245239 0.008304 0.027724 0.023653 0.250868 0.031291 0.023467 0.003738 1.948931 -0.382933 -0.040125 -0.191369 -0.195215 -0.374174 -0.043398 -0.186507 -0.191478 -0.385614 -0.050243 -0.185619 -0.187613 -0.055259 0.067786 -0.054344 0.068889
qa: 0.0947 0.1082 -0.2942 -0.2126 -0.2794 0.0537 -0.5190 -0.5248 -0.3267 -0.0634 -0.1522 0.7735 0.8087 0.0458 -0.1925 -0.1593 0.0802 -0.1308 0.6972 -1.0098 0.7403 -1.0745 -1.4658 -1.3790 0.9383 0.0997 -0.0274 -0.1331 1.0644 -0.1084 -0.0604 0.0587 0.8977 -0.0024 0.1075 -0.1673 1.0226 0.0517 -0.0442 -0.1131 3.7878 0.5071 -0.4166 -0.6156 -0.6362 0.4947 -0.4346 -0.5710 -0.5603 0.5099 -0.4399 -0.6054 -0.5708 0.2732 -0.1016 0.2791 -0.1027
va: 4.6635 4.2983 4.8147 4.5622 5.3736 4.9509 4.9300 4.8746 4.9178 5.0147 1.4277 0.7872 0.7396 4.6526 5.0078 4.5230 4.4672 1.4354 3.4843 1.6133 3.1936 1.6908 5.6114 5.5349 3.7361 0.8402 1.0683 0.9157 3.5543 1.1112 0.9085 0.8628 3.7748 1.0426 0.8437 0.9344 3.5836 0.8573 0.9106 1.1252 -1.7793 4.1128 1.7782 1.4700 1.4145 4.1471 1.7728 1.1908 1.4188 4.1331 1.7611 1.3448 1.4075 4.0526 2.5446 4.0341 2.5421
dispersion: -0.089366382 hartree
energy: -2120.723430069198 hartree
dipole: -25.03707 23.82206 -1.21501 -143.45677 137.74096 -5.71581 -42.43879 41.34189 -1.09691
magnitude: 5.94558 au
magnitude: 15.11246 debye
temp: 298.15 k
press: 1.00 atm
zeropoint: 0.37275332 hartree
thermalvibcorrection: 0.03867553 hartree
thermalrotcorrection: 0.00141627 hartree
thermaltrasncorrection: 0.00141627 hartree
thermaltotal: -2120.30916868 hartree
thermalcorr: 0.04150807 hartree
nonthermalcorr: 0.37275332 hartree
totalcorr: 0.41426139 hartree
thermalcorrenthalpy: 0.00094421 hartree
totalenthalpy: -2120.30822447 hartree
vibrat: 0.07223074 hartree
rotat: 0.01797911 hartree
transl: 0.02162418 hartree
total: 0.11183403 hartree
totalentropycorr: -0.11183403 hartree
gibbsenthalpy: -2120.42005850 hartree
gibbsminuselec: 0.30337157 hartree
