program: Orca
programVersion: 4.2.1
elementType: Cl Cl O O O N N N C C C C C C C C C C C C C C C C C C C H H H H H H H H H H H H H H H H H
charge: 0
multiplicity: 1
keywords: wb97x-d3
keywords: def2-TZVPP
keywords: def2/J RIJCOSX GRIDX6 NOFINALGRIDX
keywords: grid4 nofinalgrid
keywords: scfconv7
keywords: smallprint printgap noloewdin
keywords: NOSOSCF
formula: C19H17Cl2N3O3
InChI: InChI=1/C19H17Cl2N3O3/c1-13-9-25-19(27-13,10-24-12-22-11-23-24)17-7-6-16(8-18(17)21)26-15-4-2-14(20)3-5-15/h2-8,11-13H,9-10H2,1H3
44 atoms
Cl 2.468305 0.976112 -2.602584
Cl -7.188728 1.294673 1.535851
O  3.799318 1.186302 0.014603
O  3.094261 -0.044067 1.750067
O  -2.320355 0.165843 -1.518691
N  2.947604 -2.373874 -0.092154
N  2.82953 -3.009273 1.076598
N  1.411904 -3.874343 -0.434189
C  3.053041 0.04818 0.357186
C  4.097657 1.936949 1.195858
C  3.744579 -1.185772 -0.241498
C  3.187006 1.289377 2.227649
C  1.611274 0.152758 -0.137503
C  5.570275 1.836171 1.532047
C  1.267351 0.541044 -1.430449
C  0.567957 -0.245919 0.694559
C  -0.048279 0.572861 -1.861961
C  -0.75488 -0.240078 0.28718
C  -1.059038 0.179781 -0.999058
C  2.086513 -2.889514 -0.971453
C  1.905222 -3.896506 0.81825
C  -3.414594 0.430306 -0.73714
C  -3.42335 1.432478 0.223699
C  -4.561362 -0.304458 -1.000604
C  -4.587976 1.692724 0.929001
C  -5.728765 -0.035617 -0.304874
C  -5.732655 0.959119 0.659883
H  3.82146 2.978441 1.019268
H  4.713174 -1.335631 0.234369
H  3.917513 -1.032561 -1.30493
H  3.603159 1.27252 3.233759
H  2.202983 1.768954 2.261837
H  6.188007 2.161356 0.694658
H  5.803049 2.478249 2.381993
H  5.856009 0.815299 1.79286
H  0.790794 -0.585145 1.696207
H  -0.290022 0.8870 -2.868587
H  -1.524934 -0.573688 0.969783
H  2.003312 -2.536026 -1.987376
H  1.578786 -4.601614 1.566405
H  -2.539741 2.022768 0.427998
H  -4.547919 -1.079807 -1.755199
H  -4.596464 2.473446 1.676869
H  -6.622887 -0.605647 -0.515953
elementType: Cl O N C H
totalener: -2044.68749354 hartree
nucrepener: 2752.70356647 hartree
electener: -4797.39106001 hartree
oneelecener: -8276.32534327 hartree
twoeener: 3478.93428326 hartree
cpcmener: -0.03534990 hartree
kineticenergy: 2038.70404426 hartree
xcener: -149.988327502777 hartree
chargesum: -0.0000000
charge: -0.077259 -0.101819 -0.391243 -0.388522 -0.330009 0.130069 -0.352304 -0.403175 0.610839 0.201065 -0.142500 -0.026499 -0.127544 -0.304461 -0.029332 -0.123090 -0.210280 -0.216911 0.285356 0.060161 0.060286 0.316471 -0.213349 -0.268889 -0.124725 -0.101349 0.059534 0.082545 0.122767 0.140019 0.108743 0.101653 0.092834 0.096431 0.090354 0.147496 0.128606 0.160041 0.168301 0.161710 0.160124 0.151864 0.148065 0.147925
qa: -0.0773 -0.1018 -0.3912 -0.3885 -0.3300 0.1301 -0.3523 -0.4032 0.6108 0.2011 -0.1425 -0.0265 -0.1275 -0.3045 -0.0293 -0.1231 -0.2103 -0.2169 0.2854 0.0602 0.0603 0.3165 -0.2133 -0.2689 -0.1247 -0.1013 0.0595 0.0825 0.1228 0.1400 0.1087 0.1017 0.0928 0.0964 0.0904 0.1475 0.1286 0.1600 0.1683 0.1617 0.1601 0.1519 0.1481 0.1479
va: 1.2420 1.2019 2.0036 1.9714 2.0789 3.3396 2.8925 3.0247 3.8000 3.8694 3.9115 3.9811 3.6500 3.9625 3.9936 3.8419 4.1279 4.0120 3.7772 4.0690 4.0556 3.6649 3.9662 4.0489 3.9590 3.9426 3.8418 0.9983 1.0239 1.0120 0.9980 0.9969 1.0080 1.0061 1.0045 1.0288 1.0273 0.9954 0.9964 0.9965 0.9946 1.0057 1.0027 1.0011
dispcorr: -0.025274391 hartree
energy: -2044.712767934549
dipole: 25.52881 -24.69818 0.83063 1.03099 0.67482 1.70581 10.42847 -9.99183 0.43664
magnitude: 1.94689 au
magnitude: 4.94860 debye
