program: Gaussian 09
title: 000063294
version: EM64L-G09RevD.01
frameworkgroup: C1[X(C27H19ClN4O)]
method: RPBEPBE
basis: SDD
operation: Freq
keyword: #p
keyword: freq=noraman
keyword: PBEPBE/SDD
title: #p freq=noraman PBEPBE/SDD
converged: YES YES NO NO
title: Mulliken charges:
elementType: Cl O N N N N C C C C C C C C C C C C C C C C C C C C C C C C C C C H H H H H H H H H H H H H H H H H H H
charge: -0.048041 -0.235256 -0.343326 -0.051477 -0.068311 -0.697082 0.005921 0.138029 0.102896 0.437355 0.065629 0.302325 -0.323589 -0.333856 -0.331078 -0.354639 -0.303972 -0.352200 -0.246189 -0.206695 -0.419155 -0.414687 -0.370812 -0.382549 0.242730 0.515698 -0.382481 0.456407 -0.361008 -0.363116 -0.217155 -0.204625 -0.101855 0.271155 0.262663 0.251137 0.260270 0.258447 0.269738 0.232688 0.232176 0.220700 0.220473 0.241638 0.253273 0.307884 0.308533 0.222012 0.234104 0.282585 0.258045 0.258640
chargesum: 0.00000
title: Mulliken charges with hydrogens summed into heavy atoms:
elementType: Cl O N N N N C C C C C C C C C C C C C C C C C C C C C C C C C C C
charge: -0.048041 -0.235256 -0.343326 -0.051477 -0.068311 -0.080665 0.005921 0.138029 0.102896 0.437355 0.065629 0.302325 -0.052435 -0.071193 -0.079941 -0.094369 -0.045525 -0.082462 -0.013501 0.025481 -0.198455 -0.194214 -0.129173 -0.129275 0.242730 0.515698 -0.160469 0.456407 -0.126904 -0.080530 0.040890 0.054015 -0.101855
polarizability: 7.28179524e+02 7.01193067e+01 3.87069702e+02 1.46312673e+01 -2.91240121e+01 1.75912653e+02
1716.lowfreq: -3.5243 -0.0002 0.0011 0.0014 0.9425 3.5321 15.0184 20.3016 22.9172
frequency: 14.9437 20.2667 22.9131 30.5056 44.9370 49.1944 63.3998 64.0518 82.7916 93.2903 112.8930 125.0472 157.4387 170.4812 181.6544 193.8011 205.7393 232.0403 262.3268 281.4883 289.1462 316.2411 326.8559 342.1462 358.5170 372.3183 380.2188 385.1265 389.2666 409.5180 412.7612 413.0850 414.4553 426.3934 466.1819 473.0801 507.7775 508.9201 514.1136 524.7305 532.5596 550.2221 569.4064 621.7156 623.3067 626.1017 633.9963 647.4656 652.8552 678.7006 684.8863 693.6742 717.2081 722.2435 747.7203 780.4393 788.5376 792.9742 808.3058 815.1393 817.9551 821.8620 825.5475 832.0257 842.5248 846.7576 862.4858 873.4482 893.8467 913.3258 937.8848 949.5793 950.2213 953.7407 976.6495 978.4589 982.2146 991.7600 996.6491 998.1768 1000.7000 1004.4768 1015.5260 1019.2375 1049.5687 1068.6615 1099.6834 1103.5500 1105.3729 1118.4444 1132.6330 1163.9260 1165.9719 1175.9193 1186.0020 1200.3465 1211.3784 1230.6589 1250.3011 1256.3961 1280.7196 1289.5678 1300.9872 1307.2947 1319.5656 1326.8601 1343.8768 1362.7113 1385.7667 1393.7271 1394.0142 1401.2382 1419.9466 1439.9803 1448.9425 1457.9306 1474.8200 1493.3555 1510.2647 1519.8557 1555.8658 1562.9213 1567.3732 1583.6679 1586.7552 1602.8713 1608.0909 1617.3369 1624.6468 1631.4692 1645.9655 2951.5143 3125.1137 3128.7133 3129.0763 3134.0706 3134.8765 3149.2057 3153.1173 3153.2947 3155.9833 3164.1240 3167.1742 3171.7543 3173.2705 3173.9790 3175.3098 3176.0289 3565.6115 3705.1884
redmass: 7.6257 4.3227 7.0850 6.4915 6.0557 6.6573 4.2660 3.6750 6.0811 6.4249 7.9362 6.5685 5.4390 5.9734 5.8117 4.6499 6.7329 6.4202 6.2229 7.3222 5.5684 6.0143 4.4416 4.1653 4.8984 1.4627 1.0447 5.0106 3.6936 2.9692 2.9769 2.8896 3.4585 7.6528 4.1973 4.6412 5.3390 4.3585 6.8359 2.6699 3.7996 3.1793 7.2510 6.8693 7.0256 6.5443 6.5118 5.8663 6.5295 5.0491 5.7376 5.0461 3.6030 3.8662 4.1793 1.6977 3.2555 4.0856 1.2827 3.9203 2.0387 1.8203 1.3932 3.7790 1.4295 1.7178 4.0794 3.4794 1.4986 6.9269 1.3973 1.3533 1.3555 1.3811 1.3892 1.3739 1.4876 1.4537 3.4093 3.9231 1.3345 2.7872 2.4892 1.4562 2.9665 2.8196 3.0575 1.8528 1.6314 1.3474 1.2394 1.4752 1.3486 1.1372 1.1199 1.5465 2.2199 3.6922 2.0647 2.5008 2.6500 1.3147 1.3769 1.5085 2.3190 3.3876 2.6783 4.7481 5.7070 7.9168 3.1381 3.1197 4.0655 3.6757 2.7077 2.7025 2.5064 3.0500 3.9355 5.2090 7.4187 7.1263 7.7677 7.2147 6.1505 6.5151 9.4564 7.4975 6.6824 3.0280 1.4624 1.0863 1.0885 1.0894 1.0899 1.0861 1.0885 1.0900 1.0962 1.0885 1.0886 1.0953 1.0948 1.0954 1.0999 1.0955 1.0970 1.0974 1.0450 1.1039
irintensity: 0.1729 0.1741 0.4440 2.0240 0.7106 1.0902 0.1464 0.0300 1.3499 0.9428 1.2591 1.4548 0.8523 1.0890 1.6509 9.9824 3.6767 0.6219 9.2603 0.3847 4.9674 4.9823 3.3715 4.9823 0.7478 231.3638 1.4098 16.8955 56.6419 7.1791 1.4731 1.0306 0.2931 14.6169 8.4840 3.4502 5.9396 5.1782 4.9222 20.4602 12.1856 25.9390 8.0829 10.8965 8.0369 9.4756 0.9098 15.0171 1.2767 5.5416 3.5394 11.0523 6.5553 1.0045 0.2434 62.2392 30.9589 1.4729 1.4527 8.7982 14.6953 68.4493 19.7943 22.0657 12.7507 55.0486 35.2791 30.9769 0.8838 6.4994 3.3206 3.9188 1.6418 1.2622 3.6706 2.8955 17.0859 13.1148 2.7581 50.2034 0.0509 8.9792 22.4789 0.2799 6.8566 83.3884 1.1276 13.8908 53.8160 7.5323 22.1146 41.9095 38.2468 3.5195 36.5430 1.3348 10.8766 81.0096 16.6039 11.2712 40.2160 10.2921 26.5791 29.9909 101.8904 26.8951 15.8598 1.4370 11.9483 62.7181 3.5629 17.3403 4.1663 1.9810 0.6061 92.9710 46.7938 257.2389 322.3234 126.2329 59.5495 2.0596 60.4611 9.5204 81.9302 5.0787 224.2746 61.4836 17.2138 28.4828 310.1554 45.4278 11.7325 29.1148 9.2501 5.1862 9.5348 10.7953 8.3771 3.1073 0.3371 12.1056 7.1023 5.5131 35.2233 1.7038 2.4855 5.6996 96.2655 21.5961
temp: 298.150 k
press: 1.00000 atm
elementType: 17 8 7 7 7 7 6 6 6 6 6 6 6 6 6 6 6 6 6 6 6 6 6 6 6 6 6 6 6 6 6 6 6 1 1 1 1 1 1 1 1 1 1 1 1 1 1 1 1 1 1 1
symmnumber: 1
zpe: 1024465.0 jmol-1
zpe.correction: 0.390198 hartree
zpe.thermalcorrener: 0.417478 hartree
zpe.thermalcorrenthalpy: 0.418422 hartree
zpe.thermalcorrgfe: 0.329387 hartree
zpe.sumelectzpe: -1792.352149 hartree
zpe.sumelectthermal: -1792.324869 hartree
zpe.sumelectthermalent: -1792.323925 hartree
zpe.sumelectthermalfe: -1792.412960 hartree
dipole: 1.4961 3.8586 0.8528
dipole: 4.2254
quadrupole: -220.1560 -160.2643 -193.8526
quadrupole: 20.9962 -0.8939 -2.9527
quadrupole: -28.7317 31.1600 -2.4283 20.9962 -0.8939 -2.9527
hfenergy: -1792.7423474 hartree
pointgroup: C01 [X(C27H19Cl1N4O1)]
dipole: -0.687707 1.5071072 -0.1388026 debye
polarizability: 735.8044768|-48.5926967|367.2071198|13.1427931|55.9188745|188.1502825 unknown
InChI: InChI=1S/C27H19ClN4O/c28-20-9-5-18(6-10-20)17-30-22-13-7-19(8-14-22)26-31-25-4-2-1-3-24(25)27(33)32(26)23-15-11-21(29)12-16-23/h1-17H,29H2
charge 0 multiplicity 1
52 atoms
Cl -10.256027 -1.36395 -0.130864
O  4.994653 1.620723 0.982339
N  3.011983 0.54108 0.283667
N  3.023544 -1.779076 -0.393787
N  -3.357205 -1.307244 -0.354632
N  0.362036 5.583055 0.18133
C  2.361636 -0.662334 -0.099059
C  5.145381 -0.682796 0.244679
C  4.436747 0.570242 0.554846
C  2.321157 1.82299 0.274406
C  4.416486 -1.802954 -0.265392
C  0.872429 -0.735644 -0.151322
C  6.55328 -0.760391 0.408699
C  2.299499 2.641883 1.42634
C  1.706252 2.276668 -0.915264
C  5.120469 -2.991086 -0.613506
C  0.027357 -0.06977 0.777952
C  0.278711 -1.606817 -1.106445
C  7.235287 -1.93821 0.062138
C  6.513627 -3.054083 -0.452623
C  1.647674 3.886886 1.398761
C  1.048605 3.518695 -0.949995
C  -1.366906 -0.240592 0.731838
C  -1.113361 -1.779241 -1.157994
C  -1.962636 -1.07811 -0.257483
C  1.0078 4.347496 0.209791
C  -4.231271 -0.369395 -0.079429
C  -5.680048 -0.625556 -0.094959
C  -6.584558 0.433968 0.188953
C  -6.200161 -1.918011 -0.390179
C  -7.978707 0.219412 0.181044
C  -7.588209 -2.147056 -0.402942
C  -8.457976 -1.071572 -0.11623
H  7.077952 0.117525 0.799385
H  2.806571 2.311109 2.336578
H  1.741599 1.654057 -1.815545
H  4.543167 -3.838879 -0.994413
H  0.460094 0.570398 1.551306
H  0.936322 -2.157657 -1.784824
H  8.321533 -2.001266 0.186056
H  7.051251 -3.970573 -0.720145
H  1.643049 4.51616 2.296722
H  0.573937 3.856364 -1.878908
H  -1.996088 0.246034 1.485852
H  -1.57351 -2.45009 -1.889959
H  -0.065008 5.928308 -0.673106
H  0.368115 6.192223 0.994039
H  -3.925749 0.672557 0.155713
H  -6.195933 1.433982 0.417155
H  -5.493536 -2.725085 -0.606956
H  -8.676053 1.032936 0.399251
H  -7.99326 -3.137413 -0.629682
