program: Orca
programVersion: 5.0.4
elementType: C C C C C N C C C C H H H C N C C H C O C O N N C H H H C H H H C H H H C H H H Yb N O O O N O O O N O O O F F
elementType: Yb
keywords: def2-SVPD def2/JK def2/J def2-SVPD/C PBE rijcosx rhf hcore XYZFile VeryTightSCF freq cpcm(water) D3 defgrid3
charge: 0
multiplicity: 1
frequency: 0.00 0.00 0.00 0.00 0.00 0.00 16.30 25.66 33.64 35.88 37.30 43.52 53.74 58.57 68.62 73.84 78.99 85.86 93.57 95.01 104.05 111.02 117.41 123.12 126.78 130.59 139.04 150.09 155.87 157.84 159.66 167.00 175.32 179.63 183.27 189.35 191.53 197.59 202.22 206.30 216.82 228.38 238.72 242.50 263.14 278.10 279.31 286.97 313.46 320.63 325.09 336.72 359.65 377.02 424.73 437.04 461.65 464.13 508.58 515.07 536.65 542.01 573.95 589.08 610.68 617.29 644.48 663.24 665.00 699.72 702.03 702.60 711.29 714.15 715.36 737.57 737.80 740.42 745.70 760.92 768.44 796.65 797.10 799.15 831.24 852.62 862.63 868.24 878.00 898.82 903.86 974.22 979.81 997.08 1015.27 1045.82 1048.19 1057.67 1059.44 1061.22 1071.83 1072.48 1104.55 1115.99 1119.30 1125.06 1134.61 1149.03 1164.27 1184.06 1240.26 1243.05 1246.24 1278.72 1285.25 1293.81 1303.48 1342.96 1351.16 1361.91 1372.50 1375.49 1377.52 1381.97 1383.91 1394.45 1395.83 1400.26 1402.53 1412.41 1413.57 1413.81 1417.12 1423.84 1426.21 1455.05 1466.59 1472.44 1473.23 1478.25 1494.43 1503.44 1509.06 1558.91 1596.78 1616.06 1617.70 1620.03 1626.39 2977.10 2977.52 2980.69 2981.55 3063.20 3064.10 3068.01 3068.75 3111.37 3115.38 3120.04 3120.59 3144.11 3155.88 3171.54 3177.34
frequency: 16.30 25.66 33.64 35.88 37.30 43.52 53.74 58.57 68.62 73.84 78.99 85.86 93.57 95.01 104.05 111.02 117.41 123.12 126.78 130.59 139.04 150.09 155.87 157.84 159.66 167.00 175.32 179.63 183.27 189.35 191.53 197.59 202.22 206.30 216.82 228.38 238.72 242.50 263.14 278.10 279.31 286.97 313.46 320.63 325.09 336.72 359.65 377.02 424.73 437.04 461.65 464.13 508.58 515.07 536.65 542.01 573.95 589.08 610.68 617.29 644.48 663.24 665.00 699.72 702.03 702.60 711.29 714.15 715.36 737.57 737.80 740.42 745.70 760.92 768.44 796.65 797.10 799.15 831.24 852.62 862.63 868.24 878.00 898.82 903.86 974.22 979.81 997.08 1015.27 1045.82 1048.19 1057.67 1059.44 1061.22 1071.83 1072.48 1104.55 1115.99 1119.30 1125.06 1134.61 1149.03 1164.27 1184.06 1240.26 1243.05 1246.24 1278.72 1285.25 1293.81 1303.48 1342.96 1351.16 1361.91 1372.50 1375.49 1377.52 1381.97 1383.91 1394.45 1395.83 1400.26 1402.53 1412.41 1413.57 1413.81 1417.12 1423.84 1426.21 1455.05 1466.59 1472.44 1473.23 1478.25 1494.43 1503.44 1509.06 1558.91 1596.78 1616.06 1617.70 1620.03 1626.39 2977.10 2977.52 2980.69 2981.55 3063.20 3064.10 3068.01 3068.75 3111.37 3115.38 3120.04 3120.59 3144.11 3155.88 3171.54 3177.34
formula: C18H16F2N7O11Yb
InChI: InChI=1/C18H16F2N4O2.3NO3.Yb/c1-23(2)17(25)13-7-11(19)9-5-6-10-12(20)8-14(18(26)24(3)4)22-16(10)15(9)21-13;3*2-1(3)4;/h5-8H,1-4H3;;;;/q-4;3*-2;+10/rC18H16F2N7O11Yb/c1-21(2)17-13-7-11(19)9-5-6-10-12(20)8-14-18(22(3)4)32-39(31-17,25(28,33-39)34-39,26(29,35-39)36-39,27(30,37-39)38-39)23(13)15(9)16(10)24(14)39/h5-8H,1-4H3
55 atoms
C  -0.484458 -0.417438 -4.024476
C  -0.571542 0.945984 -4.272617
C  -0.457164 -0.945088 -2.71025
C  -0.668857 1.813106 -3.161076
C  -0.538565 0.027576 -1.671852
N  -0.657082 1.350558 -1.904313
C  -0.304063 -2.335343 -2.385937
C  -0.185812 -2.740821 -1.075482
C  -0.213499 -1.779995 -0.009414
C  -0.41232 -0.398119 -0.295722
H  -0.523524 1.309526 -5.303961
H  -0.264655 -3.069168 -3.200288
H  -0.051597 -3.802111 -0.832828
C  -0.007233 -2.076963 1.360267
N  -0.431927 0.559267 0.649783
C  -0.267787 0.238423 1.937095
C  -0.021568 -1.095168 2.341641
H  0.191341 -1.374618 3.377799
C  -0.612291 3.323878 -3.197866
O  -0.106109 3.882202 -2.180591
C  -0.253591 1.4742 2.808829
O  -0.012111 2.56632 2.215795
N  -1.043933 4.029624 -4.251322
N  -0.467721 1.430656 4.131817
C  -1.885552 3.511738 -5.329003
H  -1.296446 3.354665 -6.253221
H  -2.382811 2.577808 -5.027443
H  -2.667596 4.263545 -5.534967
C  -0.816003 5.473789 -4.271735
H  0.050204 5.725013 -3.641466
H  -0.628486 5.780964 -5.315236
H  -1.711778 6.006025 -3.895972
C  -1.031624 0.299232 4.867085
H  -1.608414 -0.359166 4.199977
H  -0.239651 -0.27532 5.385481
H  -1.723209 0.703518 5.626545
C  -0.27199 2.650802 4.914762
H  -1.241068 3.162942 5.07383
H  0.148957 2.36856 5.895741
H  0.417138 3.326767 4.387192
Yb -0.619548 2.995358 -0.032235
N  2.260734 3.282146 0.005234
O  3.486104 3.404664 0.029271
O  1.475696 4.232802 0.342331
O  1.695621 2.194595 -0.359141
N  -3.433179 2.518053 -0.695047
O  -4.619652 2.353093 -0.986329
O  -2.728337 3.440726 -1.23539
O  -2.831774 1.782941 0.154421
N  -1.950613 5.364257 1.052904
O  -2.527192 6.368688 1.478053
O  -2.217286 4.194414 1.488971
O  -1.051054 5.432056 0.147695
F  -0.384026 -1.264518 -5.057871
F  0.231701 -3.348618 1.712394
elementType: C N H O Yb F
totalener: -2141.81875187 hartree
nucrepener: 5118.50144424 hartree
electener: -7260.32019611 hartree
twoeener: 5882.55090959 hartree
cpcmener: -0.08955032 hartree
kineticenergy: 2095.58649760 hartree
exchangeener: -259.671594704324 hartree
correlationener: -9.970523073662 hartree
xcener: -269.642117777986 hartree
chargesum: 0.0000000
charge: 0.853181 -0.092060 -0.363370 -0.160152 -0.272173 0.036732 -0.488795 -0.514059 -0.442723 -0.011056 0.008995 0.713201 0.751784 0.825379 -0.220532 -0.057449 -0.119633 -0.008327 0.860087 -0.877823 0.875654 -1.035542 -1.388338 -1.329630 0.900538 0.137222 -0.015367 -0.192170 1.039574 -0.113707 -0.075501 0.059473 0.862831 0.032074 0.149923 -0.228293 1.019250 0.039005 -0.030329 -0.130024 2.786753 0.563731 -0.436972 -0.548574 -0.529393 0.544899 -0.450974 -0.493875 -0.507879 0.564263 -0.453954 -0.532432 -0.522671 -0.486811 -0.493961
charge: 0.055217 0.164167 -0.019199 0.002620 0.008643 -0.040570 0.098804 0.098641 -0.018753 0.002842 0.043109 0.040336 0.040404 0.053698 -0.049812 0.007949 0.163866 0.038201 -0.033923 -0.296491 -0.005355 -0.299325 -0.196697 -0.198917 0.244509 0.027483 0.007473 0.022553 0.252350 0.004621 0.022663 0.031737 0.243604 0.008361 0.027590 0.021335 0.250704 0.031085 0.023312 0.003684 1.504411 -0.366087 -0.038313 -0.168154 -0.166070 -0.361091 -0.041791 -0.161370 -0.162609 -0.368619 -0.046794 -0.154936 -0.165023 -0.091924 -0.094150
qa: 0.8532 -0.0921 -0.3634 -0.1602 -0.2722 0.0367 -0.4888 -0.5141 -0.4427 -0.0111 0.0090 0.7132 0.7518 0.8254 -0.2205 -0.0574 -0.1196 -0.0083 0.8601 -0.8778 0.8757 -1.0355 -1.3883 -1.3296 0.9005 0.1372 -0.0154 -0.1922 1.0396 -0.1137 -0.0755 0.0595 0.8628 0.0321 0.1499 -0.2283 1.0193 0.0390 -0.0303 -0.1300 2.7868 0.5637 -0.4370 -0.5486 -0.5294 0.5449 -0.4510 -0.4939 -0.5079 0.5643 -0.4540 -0.5324 -0.5227 -0.4868 -0.4940
va: 3.4646 3.7097 4.8130 4.0385 5.1748 5.0880 4.9596 4.8792 4.9645 4.9251 1.3755 1.0791 1.0089 3.3987 5.2181 3.9711 3.8594 1.4386 3.1103 1.5789 2.8547 1.6572 5.4865 5.4032 3.7696 0.8127 1.0325 0.9525 3.5882 1.1063 0.9068 0.8447 3.8064 0.9784 0.8192 0.9855 3.5833 0.8698 0.9012 1.1351 0.1827 4.0511 1.7772 1.4519 1.4317 4.1143 1.7793 1.1841 1.4671 4.0608 1.7768 1.3240 1.4158 1.1438 1.1490
dispersion: -0.083097641 hartree
energy: -2141.901849512523 hartree
dipole: -7.79159 8.36249 0.57089 -132.41284 124.97858 -7.43426 -40.46936 38.65355 -1.81580
magnitude: 7.67406 au
magnitude: 19.50592 debye
temp: 298.15 k
press: 1.00 atm
zeropoint: 0.36158231 hartree
thermalvibcorrection: 0.03584469 hartree
thermalrotcorrection: 0.00141627 hartree
thermaltrasncorrection: 0.00141627 hartree
thermaltotal: -2141.50158997 hartree
thermalcorr: 0.03867723 hartree
nonthermalcorr: 0.36158231 hartree
totalcorr: 0.40025954 hartree
thermalcorrenthalpy: 0.00094421 hartree
totalenthalpy: -2141.50064576 hartree
vibrat: 0.06602947 hartree
rotat: 0.01777600 hartree
transl: 0.02166195 hartree
total: 0.10546742 hartree
totalentropycorr: -0.10546742 hartree
gibbsenthalpy: -2141.60611318 hartree
gibbsminuselec: 0.29573633 hartree
