program: Orca
programVersion: 4.2.1
elementType: Cl Cl O O O N N N C C C C C C C C C C C C C C C C C C C H H H H H H H H H H H H H H H H H
charge: 0
multiplicity: 1
keywords: wb97x-d3
keywords: def2-TZVPP
keywords: def2/J RIJCOSX GRIDX6 NOFINALGRIDX
keywords: grid4 nofinalgrid
keywords: scfconv7
keywords: smallprint printgap noloewdin
keywords: NOSOSCF
formula: C19H17Cl2N3O3
InChI: InChI=1/C19H17Cl2N3O3/c1-13-9-25-19(27-13,10-24-12-22-11-23-24)17-7-6-16(8-18(17)21)26-15-4-2-14(20)3-5-15/h2-8,11-13H,9-10H2,1H3
44 atoms
Cl 1.647193 1.204977 2.741044
Cl -7.640469 0.083761 -2.020031
O  2.686073 -0.857408 -1.144681
O  3.448323 0.437192 0.502457
O  -2.700324 2.016615 0.460332
N  3.749755 -2.336012 1.008462
N  3.948253 -3.377478 0.197634
N  5.847669 -2.831309 1.248988
C  2.425069 -0.445163 0.16453
C  3.607885 0.0456 -1.760281
C  2.477781 -1.668684 1.083381
C  3.778912 1.122691 -0.690832
C  1.052045 0.220539 0.254428
C  4.889014 -0.676242 -2.116217
C  0.630455 0.96349 1.356769
C  0.143477 0.08286 -0.790914
C  -0.629453 1.534993 1.417922
C  -1.116752 0.655106 -0.765139
C  -1.502846 1.381305 0.351821
C  4.891365 -2.016189 1.623641
C  5.215973 -3.643382 0.377216
C  -3.819021 1.514596 -0.144878
C  -4.671519 2.424601 -0.751322
C  -4.142542 0.164504 -0.103897
C  -5.855786 1.986916 -1.322942
C  -5.319024 -0.275545 -0.6886
C  -6.168071 0.637402 -1.294828
H  3.148028 0.456794 -2.662771
H  1.70495 -2.378085 0.792583
H  2.287739 -1.382788 2.116482
H  4.799134 1.496676 -0.608124
H  3.109053 1.97363 -0.856968
H  4.689242 -1.557559 -2.726309
H  5.537695 -0.015418 -2.693077
H  5.438622 -0.991822 -1.22782
H  0.42653 -0.48622 -1.665068
H  -0.934259 2.104552 2.286053
H  -1.773824 0.531899 -1.615656
H  4.974134 -1.206161 2.330728
H  5.705591 -4.456182 -0.136675
H  -4.416616 3.476294 -0.772872
H  -3.494307 -0.553127 0.382474
H  -6.520964 2.699395 -1.791405
H  -5.569665 -1.327095 -0.658583
elementType: Cl O N C H
totalener: -2044.69940760 hartree
nucrepener: 2695.86420659 hartree
electener: -4740.56361419 hartree
oneelecener: -8162.04801751 hartree
twoeener: 3421.48440331 hartree
cpcmener: -0.02887997 hartree
kineticenergy: 2038.69694156 hartree
xcener: -149.987779820485 hartree
chargesum: 0.0000000
charge: -0.080921 -0.099038 -0.395217 -0.361553 -0.321410 0.133029 -0.340339 -0.409625 0.587039 0.155270 -0.130880 0.009636 -0.178040 -0.299086 0.040720 -0.108344 -0.240977 -0.228611 0.284149 0.061939 0.051132 0.301237 -0.256627 -0.210787 -0.103678 -0.121294 0.060353 0.082634 0.129625 0.149332 0.109627 0.094290 0.094363 0.105846 0.077479 0.151315 0.129349 0.156607 0.161307 0.158584 0.150204 0.159009 0.146078 0.146272
qa: -0.0809 -0.0990 -0.3952 -0.3616 -0.3214 0.1330 -0.3403 -0.4096 0.5870 0.1553 -0.1309 0.0096 -0.1780 -0.2991 0.0407 -0.1083 -0.2410 -0.2286 0.2841 0.0619 0.0511 0.3012 -0.2566 -0.2108 -0.1037 -0.1213 0.0604 0.0826 0.1296 0.1493 0.1096 0.0943 0.0944 0.1058 0.0775 0.1513 0.1293 0.1566 0.1613 0.1586 0.1502 0.1590 0.1461 0.1463
va: 1.2387 1.2046 1.9944 1.9905 2.0904 3.3677 2.8862 3.0169 3.8679 3.8872 3.7972 3.9327 3.6126 3.9734 3.9586 3.9327 4.1338 3.9874 3.7896 4.0631 4.0472 3.6861 4.0461 3.9646 3.9446 3.9579 3.8528 0.9987 1.0239 1.0155 0.9950 1.0030 1.0086 1.0082 1.0050 1.0245 1.0277 0.9980 1.0075 0.9977 1.0056 0.9942 1.0018 1.0031
dispcorr: -0.024760702 hartree
energy: -2044.724168302260
dipole: 26.03164 -26.84367 -0.81203 -3.20532 4.67786 1.47254 -9.93566 9.23324 -0.70242
magnitude: 1.82240 au
magnitude: 4.63218 debye
