program: Orca
programVersion: 5.0.4
elementType: C C C C C N C C C C H H H C N C C H C O C O N N C H H H C H H H C H H H C H H H Sm N O O O N O O O N O O O F F
elementType: Sm
keywords: def2-SVPD def2/JK def2/J def2-SVPD/C PBE rijcosx rhf hcore XYZFile VeryTightSCF freq cpcm(water) D3 defgrid3
charge: 0
multiplicity: 1
frequency: 0.00 0.00 0.00 0.00 0.00 0.00 18.63 25.00 31.81 33.66 37.62 41.24 46.38 49.47 71.12 73.85 79.59 83.95 84.86 94.52 96.93 103.05 106.18 108.54 111.27 121.79 123.64 133.55 138.93 156.03 163.52 168.01 169.21 177.50 183.19 187.62 188.76 198.63 203.75 204.92 208.97 226.60 237.80 240.22 259.39 275.75 279.25 283.27 304.63 321.26 322.91 335.87 355.20 372.88 418.53 433.06 456.36 460.49 504.78 512.08 535.12 545.15 569.12 585.20 609.56 621.49 643.98 662.13 663.45 702.19 703.80 703.86 709.42 713.30 715.80 732.40 735.01 736.39 739.96 761.36 766.68 798.35 798.50 799.75 831.92 856.89 863.67 871.68 878.26 898.28 901.84 975.52 978.65 996.70 1012.88 1045.27 1047.77 1052.13 1055.25 1056.94 1071.55 1072.72 1102.66 1115.21 1119.90 1123.81 1134.91 1148.07 1162.69 1182.28 1239.07 1242.19 1245.49 1272.10 1278.53 1282.12 1289.77 1341.64 1348.78 1361.20 1371.68 1375.53 1377.21 1381.79 1384.81 1394.02 1395.44 1398.54 1401.38 1411.25 1412.88 1413.85 1415.59 1422.27 1424.04 1452.68 1463.28 1472.99 1474.07 1475.02 1490.99 1504.61 1508.35 1556.27 1597.03 1614.11 1616.04 1618.70 1624.38 2977.33 2977.88 2980.87 2981.66 3060.30 3063.21 3066.79 3067.38 3111.73 3112.11 3120.51 3122.06 3144.57 3156.34 3165.46 3171.85
frequency: 18.63 25.00 31.81 33.66 37.62 41.24 46.38 49.47 71.12 73.85 79.59 83.95 84.86 94.52 96.93 103.05 106.18 108.54 111.27 121.79 123.64 133.55 138.93 156.03 163.52 168.01 169.21 177.50 183.19 187.62 188.76 198.63 203.75 204.92 208.97 226.60 237.80 240.22 259.39 275.75 279.25 283.27 304.63 321.26 322.91 335.87 355.20 372.88 418.53 433.06 456.36 460.49 504.78 512.08 535.12 545.15 569.12 585.20 609.56 621.49 643.98 662.13 663.45 702.19 703.80 703.86 709.42 713.30 715.80 732.40 735.01 736.39 739.96 761.36 766.68 798.35 798.50 799.75 831.92 856.89 863.67 871.68 878.26 898.28 901.84 975.52 978.65 996.70 1012.88 1045.27 1047.77 1052.13 1055.25 1056.94 1071.55 1072.72 1102.66 1115.21 1119.90 1123.81 1134.91 1148.07 1162.69 1182.28 1239.07 1242.19 1245.49 1272.10 1278.53 1282.12 1289.77 1341.64 1348.78 1361.20 1371.68 1375.53 1377.21 1381.79 1384.81 1394.02 1395.44 1398.54 1401.38 1411.25 1412.88 1413.85 1415.59 1422.27 1424.04 1452.68 1463.28 1472.99 1474.07 1475.02 1490.99 1504.61 1508.35 1556.27 1597.03 1614.11 1616.04 1618.70 1624.38 2977.33 2977.88 2980.87 2981.66 3060.30 3063.21 3066.79 3067.38 3111.73 3112.11 3120.51 3122.06 3144.57 3156.34 3165.46 3171.85
formula: C18H16F2N7O11Sm
InChI: InChI=1/C18H16F2N4O2.3NO3.Sm/c1-23(2)17(25)13-7-11(19)9-5-6-10-12(20)8-14(18(26)24(3)4)22-16(10)15(9)21-13;3*2-1(3)4;/h5-8H,1-4H3;;;;/q-4;3*-2;+10/rC18H16F2N7O11Sm/c1-21(2)17-13-7-11(19)9-5-6-10-12(20)8-14-18(22(3)4)32-39(31-17,33-25(28)34-39,35-26(29)36-39,37-27(30)38-39)23(13)15(9)16(10)24(14)39/h5-8H,1-4H3
55 atoms
C  -0.414032 -0.439542 -4.042222
C  -0.529405 0.919088 -4.300019
C  -0.367992 -0.956258 -2.723788
C  -0.624481 1.788934 -3.191153
C  -0.451149 0.020436 -1.687078
N  -0.582828 1.341484 -1.929903
C  -0.204239 -2.344913 -2.40118
C  -0.090306 -2.749862 -1.090976
C  -0.134302 -1.789795 -0.025734
C  -0.331752 -0.405167 -0.307769
H  -0.50612 1.28224 -5.333331
H  -0.157829 -3.07754 -3.216207
H  0.047797 -3.810242 -0.846735
C  0.047675 -2.099714 1.344417
N  -0.371518 0.544719 0.647506
C  -0.240975 0.206067 1.934771
C  0.002773 -1.128921 2.334211
H  0.189017 -1.412675 3.374666
C  -0.604069 3.298777 -3.264053
O  -0.001159 3.892433 -2.322682
C  -0.264457 1.414196 2.844034
O  0.052595 2.520836 2.317459
N  -1.178102 3.962678 -4.275469
N  -0.596222 1.324528 4.140616
C  -2.124532 3.389379 -5.231249
H  -1.655361 3.265625 -6.226116
H  -2.517613 2.42624 -4.872723
H  -2.972998 4.090125 -5.328192
C  -1.006356 5.412249 -4.355161
H  -0.087248 5.708621 -3.827962
H  -0.943611 5.69734 -5.419828
H  -1.875147 5.924122 -3.896858
C  -1.248928 0.180282 4.776388
H  -1.761165 -0.448523 4.03252
H  -0.523218 -0.422157 5.356145
H  -2.010799 0.572726 5.472514
C  -0.448851 2.507198 4.988312
H  -1.424323 3.019506 5.100873
H  -0.101158 2.179063 5.983772
H  0.279321 3.200183 4.54157
Sm -0.472155 3.097968 -0.017095
N  2.51141 3.262493 0.052518
O  3.739873 3.328963 0.100659
O  1.768463 4.250665 0.386179
O  1.908009 2.202789 -0.333805
N  -3.40437 2.695483 -0.554478
O  -4.609246 2.556634 -0.772755
O  -2.694117 3.531914 -1.214591
O  -2.795655 2.013127 0.336412
N  -1.6514 5.713261 0.92418
O  -2.167743 6.773624 1.286579
O  -1.932316 4.601133 1.490756
O  -0.810104 5.666073 -0.035438
F  0.28634 -3.373711 1.68762
F  -0.310956 -1.294531 -5.068821
elementType: C N H O Sm F
totalener: -2137.13017251 hartree
nucrepener: 5047.37672316 hartree
electener: -7184.50689566 hartree
twoeener: 5808.10074973 hartree
cpcmener: -0.08943265 hartree
kineticenergy: 2093.20419456 hartree
exchangeener: -259.166537797706 hartree
correlationener: -9.951063045975 hartree
xcener: -269.117600843681 hartree
chargesum: 0.0000000
charge: 0.850396 0.015918 -0.332265 -0.221064 -0.375343 -0.167671 -0.501415 -0.494333 -0.425193 -0.082459 0.031681 0.730436 0.785034 0.821163 -0.314691 -0.156675 -0.003811 -0.015944 0.793364 -1.108427 0.801756 -1.139555 -1.433594 -1.341220 0.935806 0.094438 -0.038933 -0.138363 1.051349 -0.112049 -0.067449 0.062960 0.876538 0.023857 0.126671 -0.210490 1.020798 0.039274 -0.031671 -0.133643 4.102965 0.542619 -0.420061 -0.624059 -0.660990 0.526951 -0.436238 -0.581738 -0.588632 0.547306 -0.444684 -0.629597 -0.579439 -0.488072 -0.481510
charge: 0.052874 0.160260 -0.021979 -0.009015 0.006332 -0.045375 0.096923 0.096816 -0.021717 0.002544 0.048745 0.040086 0.040169 0.051814 -0.048586 -0.002221 0.159796 0.040650 -0.048036 -0.309318 -0.016374 -0.315887 -0.199433 -0.201056 0.243447 0.026107 0.006688 0.022644 0.250684 0.003751 0.022123 0.030283 0.241927 0.008488 0.026579 0.021137 0.248769 0.030290 0.023213 0.001983 1.732189 -0.375424 -0.040045 -0.178640 -0.179853 -0.368314 -0.043578 -0.173223 -0.177636 -0.378536 -0.051300 -0.172524 -0.172858 -0.094025 -0.092358
qa: 0.8504 0.0159 -0.3323 -0.2211 -0.3753 -0.1677 -0.5014 -0.4943 -0.4252 -0.0825 0.0317 0.7304 0.7850 0.8212 -0.3147 -0.1567 -0.0038 -0.0159 0.7934 -1.1084 0.8018 -1.1396 -1.4336 -1.3412 0.9358 0.0944 -0.0389 -0.1384 1.0513 -0.1120 -0.0674 0.0630 0.8765 0.0239 0.1267 -0.2105 1.0208 0.0393 -0.0317 -0.1336 4.1030 0.5426 -0.4201 -0.6241 -0.6610 0.5270 -0.4362 -0.5817 -0.5886 0.5473 -0.4447 -0.6296 -0.5794 -0.4881 -0.4815
va: 3.5861 3.7215 4.7853 4.2649 5.3460 5.1731 5.0324 4.9476 4.9555 5.0018 1.3124 1.0412 0.9482 3.5199 5.3494 4.2041 3.9287 1.3601 3.3247 1.4604 3.0509 1.4749 5.5385 5.4149 3.7389 0.8443 1.0684 0.9244 3.5745 1.1153 0.9087 0.8532 3.7950 0.9988 0.8366 0.9679 3.5794 0.8661 0.9003 1.1394 -2.9409 4.0560 1.7883 1.5371 1.5588 4.0943 1.7884 1.1910 1.5093 4.0701 1.7700 1.4027 1.4778 1.1453 1.1359
dispersion: -0.082537556 hartree
energy: -2137.212710062711 hartree
dipole: -18.56117 18.31974 -0.24143 -123.90869 115.87555 -8.03314 -36.66868 34.83005 -1.83863
magnitude: 8.24441 au
magnitude: 20.95562 debye
temp: 298.15 k
press: 1.00 atm
zeropoint: 0.36078242 hartree
thermalvibcorrection: 0.03621430 hartree
thermalrotcorrection: 0.00141627 hartree
thermaltrasncorrection: 0.00141627 hartree
thermaltotal: -2136.81288080 hartree
thermalcorr: 0.03904684 hartree
nonthermalcorr: 0.36078242 hartree
totalcorr: 0.39982926 hartree
thermalcorrenthalpy: 0.00094421 hartree
totalenthalpy: -2136.81193659 hartree
vibrat: 0.06696963 hartree
rotat: 0.01781820 hartree
transl: 0.02161654 hartree
total: 0.10640437 hartree
totalentropycorr: -0.10640437 hartree
gibbsenthalpy: -2136.91834096 hartree
gibbsminuselec: 0.29436910 hartree
