program: Orca
programVersion: 4.2.1
elementType: Cl Cl O O O N N N C C C C C C C C C C C C C C C C C C C H H H H H H H H H H H H H H H H H
charge: 0
multiplicity: 1
keywords: wb97x-d3
keywords: def2-TZVPP
keywords: def2/J RIJCOSX GRIDX6 NOFINALGRIDX
keywords: grid4 nofinalgrid
keywords: scfconv7
keywords: smallprint printgap noloewdin
keywords: NOSOSCF
formula: C19H17Cl2N3O3
InChI: InChI=1/C19H17Cl2N3O3/c1-13-9-25-19(27-13,10-24-12-22-11-23-24)17-7-6-16(8-18(17)21)26-15-4-2-14(20)3-5-15/h2-8,11-13H,9-10H2,1H3
44 atoms
Cl 2.537903 0.547224 -2.736113
Cl -7.030988 1.385063 1.605355
O  3.880336 1.027324 -0.129332
O  3.101567 0.068247 1.714531
O  -2.283899 0.12093 -1.580644
N  2.924343 -2.46469 0.265195
N  2.06657 -3.007012 -0.601283
N  1.888629 -3.995069 1.399324
C  3.078412 -0.015048 0.316839
C  3.643589 2.126468 0.742969
C  3.737863 -1.333641 -0.097262
C  3.262193 1.436244 2.062066
C  1.642868 0.082562 -0.19438
C  4.875264 2.992639 0.821799
C  1.316364 0.308581 -1.529792
C  0.582748 -0.139189 0.678569
C  0.004274 0.346276 -1.969018
C  -0.738969 -0.126816 0.26752
C  -1.024988 0.124852 -1.065882
C  2.803505 -3.057848 1.455557
C  1.469222 -3.918516 0.1205
C  -3.357584 0.423916 -0.788743
C  -4.453996 -0.421381 -0.843876
C  -3.387638 1.569755 -0.004665
C  -5.592926 -0.122097 -0.112222
C  -4.51982 1.862493 0.737602
C  -5.614943 1.014353 0.679355
H  2.800252 2.717844 0.367773
H  4.710734 -1.417545 0.387443
H  3.89269 -1.366125 -1.173268
H  4.049227 1.510394 2.815949
H  2.342419 1.848864 2.484004
H  5.734453 2.429678 1.18965
H  5.1261 3.415894 -0.151061
H  4.698603 3.824008 1.504775
H  0.787368 -0.342701 1.720254
H  -0.223512 0.535562 -3.009788
H  -1.520686 -0.322998 0.989033
H  3.396692 -2.784729 2.313538
H  0.705912 -4.56028 -0.291504
H  -4.425323 -1.309814 -1.461238
H  -2.540326 2.242208 0.033272
H  -6.449486 -0.780283 -0.159298
H  -4.542898 2.75371 1.349615
elementType: Cl O N C H
totalener: -2044.69856516 hartree
nucrepener: 2754.31955610 hartree
electener: -4799.01812126 hartree
oneelecener: -8279.62799688 hartree
twoeener: 3480.60987562 hartree
cpcmener: -0.02900040 hartree
kineticenergy: 2038.71561997 hartree
xcener: -149.990451039146 hartree
chargesum: 0.0000000
charge: -0.080331 -0.098490 -0.364514 -0.394449 -0.321231 0.109315 -0.337384 -0.406266 0.595296 0.142608 -0.090004 0.002715 -0.189309 -0.286482 0.045774 -0.114179 -0.231385 -0.237072 0.292730 0.064880 0.059380 0.282681 -0.242470 -0.200422 -0.108129 -0.123574 0.065934 0.082276 0.127664 0.129979 0.093547 0.092248 0.084897 0.097178 0.098335 0.150650 0.125698 0.153163 0.168281 0.160386 0.150466 0.157733 0.145399 0.146479
qa: -0.0803 -0.0985 -0.3645 -0.3944 -0.3212 0.1093 -0.3374 -0.4063 0.5953 0.1426 -0.0900 0.0027 -0.1893 -0.2865 0.0458 -0.1142 -0.2314 -0.2371 0.2927 0.0649 0.0594 0.2827 -0.2425 -0.2004 -0.1081 -0.1236 0.0659 0.0823 0.1277 0.1300 0.0935 0.0922 0.0849 0.0972 0.0983 0.1506 0.1257 0.1532 0.1683 0.1604 0.1505 0.1577 0.1454 0.1465
va: 1.2405 1.2051 2.0194 1.9678 2.0893 3.3632 2.8777 3.0370 3.8403 3.8547 3.8247 3.9330 3.6247 3.9744 3.9460 3.8887 4.1388 4.0159 3.7688 4.0660 4.0437 3.6985 4.0441 3.9704 3.9459 3.9585 3.8477 1.0032 1.0225 1.0278 1.0008 0.9948 1.0070 1.0037 1.0022 1.0206 1.0286 0.9993 1.0051 0.9961 1.0050 0.9952 1.0019 1.0032
dispcorr: -0.025004160 hartree
energy: -2044.723569320029
dipole: 23.41573 -22.53498 0.88074 5.19114 -3.33137 1.85977 9.90841 -8.97133 0.93708
magnitude: 2.26110 au
magnitude: 5.74725 debye
