program: Orca
programVersion: 4.2.1
elementType: Cl Cl O O O N N N C C C C C C C C C C C C C C C C C C C H H H H H H H H H H H H H H H H H
charge: 0
multiplicity: 1
keywords: wb97x-d3
keywords: def2-TZVPP
keywords: def2/J RIJCOSX GRIDX6 NOFINALGRIDX
keywords: grid4 nofinalgrid
keywords: scfconv7
keywords: smallprint printgap noloewdin
keywords: NOSOSCF
formula: C19H17Cl2N3O3
InChI: InChI=1/C19H17Cl2N3O3/c1-13-9-25-19(27-13,10-24-12-22-11-23-24)17-7-6-16(8-18(17)21)26-15-4-2-14(20)3-5-15/h2-8,11-13H,9-10H2,1H3
44 atoms
Cl 2.304056 -1.073126 -1.975743
Cl -7.30461 0.539023 1.234401
O  3.940586 0.183859 0.04357
O  3.119069 1.409362 1.694781
O  -2.210189 0.997273 -1.619264
N  2.541848 -2.153935 1.156229
N  1.293553 -2.578237 0.947654
N  2.767641 -4.008161 0.056167
C  2.851874 0.290571 0.893855
C  4.300943 1.510671 -0.323467
C  2.817077 -0.916258 1.834709
C  3.845353 2.332224 0.895369
C  1.525012 0.477749 0.154765
C  5.779821 1.57734 -0.609936
C  1.200079 -0.090694 -1.074572
C  0.530045 1.226188 0.782834
C  -0.052594 0.078777 -1.647714
C  -0.724576 1.412263 0.234248
C  -1.011307 0.827753 -0.990683
C  3.409829 -3.013101 0.615545
C  1.477766 -3.689136 0.282755
C  -3.368108 0.879814 -0.903136
C  -4.414431 1.723011 -1.24669
C  -3.531338 -0.075358 0.092211
C  -5.631986 1.613975 -0.594003
C  -4.745406 -0.176977 0.752499
C  -5.78769 0.668644 0.407037
H  3.738939 1.812384 -1.215332
H  2.055036 -0.769269 2.598861
H  3.783333 -1.001173 2.332944
H  4.683757 2.712081 1.483388
H  3.219364 3.178546 0.60151
H  6.057868 2.596506 -0.880573
H  6.36716 1.286681 0.262526
H  6.05168 0.930685 -1.444736
H  0.740365 1.687305 1.738107
H  -0.284585 -0.37387 -2.602735
H  -1.457841 2.010987 0.758619
H  4.478819 -2.877003 0.662191
H  0.649863 -4.300241 -0.04225
H  -4.282968 2.461957 -2.026485
H  -2.728035 -0.749675 0.360438
H  -6.446229 2.272152 -0.864769
H  -4.87047 -0.920725 1.527638
elementType: Cl O N C H
totalener: -2044.69615189 hartree
nucrepener: 2773.79360066 hartree
electener: -4818.48975256 hartree
oneelecener: -8318.81116271 hartree
twoeener: 3500.32141016 hartree
cpcmener: -0.02890381 hartree
kineticenergy: 2038.70844871 hartree
xcener: -149.989814745096 hartree
chargesum: 0.0000000
charge: -0.078841 -0.100580 -0.366151 -0.390991 -0.325840 0.103777 -0.347891 -0.399600 0.593248 0.121327 -0.061714 0.025029 -0.083788 -0.285518 -0.017134 -0.179930 -0.173984 -0.187220 0.215863 0.060007 0.061438 0.276331 -0.250337 -0.177812 -0.106588 -0.138717 0.065759 0.082654 0.128651 0.122258 0.094895 0.090269 0.097890 0.084098 0.096655 0.145934 0.127076 0.157090 0.168727 0.159164 0.149555 0.153633 0.145273 0.146032
qa: -0.0788 -0.1006 -0.3662 -0.3910 -0.3258 0.1038 -0.3479 -0.3996 0.5932 0.1213 -0.0617 0.0250 -0.0838 -0.2855 -0.0171 -0.1799 -0.1740 -0.1872 0.2159 0.0600 0.0614 0.2763 -0.2503 -0.1778 -0.1066 -0.1387 0.0658 0.0827 0.1287 0.1223 0.0949 0.0903 0.0979 0.0841 0.0967 0.1459 0.1271 0.1571 0.1687 0.1592 0.1496 0.1536 0.1453 0.1460
va: 1.2361 1.2029 2.0109 1.9757 2.0770 3.3511 2.8480 3.0277 3.8346 3.8581 3.8319 3.9164 3.5564 3.9751 3.9447 4.0022 4.0943 3.9545 3.8332 4.0756 4.0396 3.7064 4.0344 3.9288 3.9534 3.9780 3.8441 1.0028 1.0118 1.0216 0.9991 0.9982 1.0025 1.0078 1.0035 1.0239 1.0272 0.9961 0.9996 0.9958 1.0058 1.0030 1.0018 1.0034
dispcorr: -0.025454881 hartree
energy: -2044.721606773986
dipole: 27.35065 -26.09098 1.25968 10.37404 -8.08851 2.28553 3.93197 -3.34620 0.58578
magnitude: 2.67462 au
magnitude: 6.79834 debye
