program: Orca
programVersion: 4.2.1
elementType: Cl Cl O O O N N N C C C C C C C C C C C C C C C C C C C H H H H H H H H H H H H H H H H H
charge: 0
multiplicity: 1
keywords: wb97x-d3
keywords: def2-TZVPP
keywords: def2/J RIJCOSX GRIDX6 NOFINALGRIDX
keywords: grid4 nofinalgrid
keywords: scfconv7
keywords: smallprint printgap noloewdin
keywords: NOSOSCF
formula: C19H17Cl2N3O3
InChI: InChI=1/C19H17Cl2N3O3/c1-13-9-25-19(27-13,10-24-12-22-11-23-24)17-7-6-16(8-18(17)21)26-15-4-2-14(20)3-5-15/h2-8,11-13H,9-10H2,1H3
44 atoms
Cl 0.887692 1.526742 2.135159
Cl -7.081514 -0.033661 0.93529
O  4.039907 -0.107152 -0.647218
O  3.634905 1.293998 1.037113
O  -2.043086 0.825122 -1.924478
N  2.461936 -2.14413 0.764404
N  1.166051 -2.398196 0.960229
N  2.039437 -3.858863 -0.494099
C  3.123048 0.185692 0.369948
C  4.820032 1.059133 -0.929595
C  3.093158 -0.991241 1.35297
C  4.241571 2.092753 0.038998
C  1.740421 0.440413 -0.226567
C  6.285281 0.759513 -0.705409
C  0.686421 0.993676 0.497652
C  1.4613 0.029316 -1.52611
C  -0.581195 1.140017 -0.040227
C  0.199448 0.141424 -2.082634
C  -0.823269 0.694017 -1.331425
C  2.968094 -3.015954 -0.112377
C  0.957907 -3.433296 0.189223
C  -3.185291 0.611025 -1.20583
C  -4.273028 1.422052 -1.493485
C  -3.295181 -0.406993 -0.266682
C  -5.478146 1.219415 -0.840388
C  -4.496688 -0.601489 0.395607
C  -5.580535 0.212601 0.106056
H  4.651887 1.358737 -1.967604
H  2.539733 -0.732878 2.252847
H  4.113434 -1.24363 1.643033
H  4.999225 2.720804 0.5074
H  3.507146 2.742176 -0.449516
H  6.489906 0.523401 0.340838
H  6.614949 -0.080472 -1.318297
H  6.889655 1.624525 -0.981825
H  2.246202 -0.410905 -2.124244
H  -1.367203 1.593898 0.549107
H  0.012748 -0.201008 -3.092001
H  3.999943 -3.005015 -0.425936
H  -0.009508 -3.906478 0.120893
H  -4.18297 2.20944 -2.230689
H  -2.458248 -1.055553 -0.040635
H  -6.324567 1.852696 -1.068388
H  -4.57934 -1.391778 1.129251
elementType: Cl O N C H
totalener: -2044.69730497 hartree
nucrepener: 2780.70389586 hartree
electener: -4825.40120083 hartree
oneelecener: -8332.46303012 hartree
twoeener: 3507.06182929 hartree
cpcmener: -0.02738478 hartree
kineticenergy: 2038.70407857 hartree
xcener: -149.987813427500 hartree
chargesum: 0.0000000
charge: -0.079349 -0.100162 -0.399736 -0.355832 -0.322616 0.111690 -0.333293 -0.404577 0.575036 0.142375 -0.097812 0.013221 -0.212551 -0.295122 0.057916 -0.075486 -0.181922 -0.293473 0.291312 0.059405 0.062901 0.290428 -0.257321 -0.192629 -0.103689 -0.134011 0.064752 0.083255 0.129412 0.128003 0.108261 0.091784 0.088099 0.093492 0.095244 0.149992 0.132820 0.148185 0.168239 0.157513 0.148793 0.156959 0.145405 0.145088
qa: -0.0793 -0.1002 -0.3997 -0.3558 -0.3226 0.1117 -0.3333 -0.4046 0.5750 0.1424 -0.0978 0.0132 -0.2126 -0.2951 0.0579 -0.0755 -0.1819 -0.2935 0.2913 0.0594 0.0629 0.2904 -0.2573 -0.1926 -0.1037 -0.1340 0.0648 0.0833 0.1294 0.1280 0.1083 0.0918 0.0881 0.0935 0.0952 0.1500 0.1328 0.1482 0.1682 0.1575 0.1488 0.1570 0.1454 0.1451
va: 1.2450 1.2034 1.9749 2.0143 2.0873 3.3567 2.8665 3.0402 3.8775 3.8740 3.8475 3.9437 3.6543 3.9748 3.9324 3.8168 4.0082 4.1234 3.7513 4.0727 4.0338 3.6973 4.0401 3.9415 3.9475 3.9788 3.8467 0.9987 1.0267 1.0175 0.9932 1.0026 1.0056 1.0055 1.0059 1.0206 1.0223 1.0075 1.0061 0.9967 1.0064 0.9985 1.0018 1.0039
dispcorr: -0.025752419 hartree
energy: -2044.723057392117
dipole: 33.90472 -31.86770 2.03702 0.39320 1.06133 1.45453 -10.86748 10.11050 -0.75699
magnitude: 2.61498 au
magnitude: 6.64676 debye
