program: Orca
programVersion: 4.2.1
elementType: Cl Cl O O O N N N C C C C C C C C C C C C C C C C C C C H H H H H H H H H H H H H H H H H
charge: 0
multiplicity: 1
keywords: wb97x-d3
keywords: def2-TZVPP
keywords: def2/J RIJCOSX GRIDX6 NOFINALGRIDX
keywords: grid4 nofinalgrid
keywords: scfconv7
keywords: smallprint printgap noloewdin
keywords: NOSOSCF
formula: C19H17Cl2N3O3
InChI: InChI=1/C19H17Cl2N3O3/c1-13-9-25-19(27-13,10-24-12-22-11-23-24)17-7-6-16(8-18(17)21)26-15-4-2-14(20)3-5-15/h2-8,11-13H,9-10H2,1H3
44 atoms
Cl 0.989537 0.247907 -2.299803
Cl -6.831191 2.135349 -1.450706
O  3.468163 1.004495 -0.82805
O  3.879969 0.113475 1.16304
O  -2.377352 -0.336445 1.43752
N  3.138257 -2.51217 0.059288
N  2.012728 -3.15547 -0.258052
N  2.924031 -4.036172 1.587022
C  3.121463 -0.056833 -0.001878
C  3.64781 2.138246 0.013083
C  3.569279 -1.354683 -0.680763
C  4.079196 1.507787 1.347114
C  1.632201 -0.077562 0.337091
C  4.664533 3.070789 -0.596231
C  0.625784 0.036399 -0.617887
C  1.224955 -0.287777 1.651929
C  -0.719118 -0.033293 -0.289125
C  -0.107771 -0.353569 2.013145
C  -1.082699 -0.221338 1.036663
C  3.667976 -3.042617 1.164971
C  1.926524 -4.061394 0.680627
C  -3.381282 0.262219 0.725764
C  -4.491761 -0.504258 0.410198
C  -3.329293 1.606867 0.38216
C  -5.5626 0.074306 -0.253989
C  -4.392602 2.182545 -0.293588
C  -5.502014 1.412186 -0.607767
H  2.691891 2.661414 0.132989
H  4.656451 -1.360665 -0.763742
H  3.154366 -1.428847 -1.683245
H  5.135229 1.678481 1.568784
H  3.487256 1.88635 2.184449
H  4.330212 3.445997 -1.563903
H  4.812939 3.932356 0.055666
H  5.62826 2.576133 -0.72737
H  1.969606 -0.400303 2.427187
H  -1.464483 0.047959 -1.068925
H  -0.38801 -0.511509 3.046374
H  4.582495 -2.685184 1.611154
H  1.114339 -4.771117 0.712403
H  -4.527284 -1.550154 0.686244
H  -2.471461 2.215551 0.638329
H  -6.42982 -0.523988 -0.497764
H  -4.351605 3.228826 -0.564051
elementType: Cl O N C H
totalener: -2044.69848267 hartree
nucrepener: 2762.51701576 hartree
electener: -4807.21549843 hartree
oneelecener: -8296.10587856 hartree
twoeener: 3488.89038012 hartree
cpcmener: -0.02892474 hartree
kineticenergy: 2038.70276404 hartree
xcener: -149.987997658379 hartree
chargesum: -0.0000000
charge: -0.078564 -0.098345 -0.364189 -0.390349 -0.319590 0.112092 -0.336241 -0.405236 0.582297 0.146328 -0.088662 -0.000421 -0.197947 -0.285647 0.018612 -0.085304 -0.165689 -0.295753 0.297381 0.060579 0.058791 0.271889 -0.240805 -0.194990 -0.108604 -0.124669 0.067800 0.080394 0.129147 0.129625 0.094257 0.093472 0.096465 0.098435 0.084423 0.151353 0.128620 0.147703 0.169030 0.160138 0.150823 0.158951 0.145732 0.146664
qa: -0.0786 -0.0983 -0.3642 -0.3903 -0.3196 0.1121 -0.3362 -0.4052 0.5823 0.1463 -0.0887 -0.0004 -0.1979 -0.2856 0.0186 -0.0853 -0.1657 -0.2958 0.2974 0.0606 0.0588 0.2719 -0.2408 -0.1950 -0.1086 -0.1247 0.0678 0.0804 0.1291 0.1296 0.0943 0.0935 0.0965 0.0984 0.0844 0.1514 0.1286 0.1477 0.1690 0.1601 0.1508 0.1590 0.1457 0.1467
va: 1.2453 1.2050 2.0216 1.9689 2.0913 3.3644 2.8787 3.0349 3.8550 3.8515 3.8162 3.9322 3.6067 3.9744 3.9855 3.8342 3.9826 4.1113 3.7615 4.0690 4.0453 3.7072 4.0443 3.9669 3.9473 3.9590 3.8481 1.0041 1.0221 1.0282 1.0010 0.9940 1.0039 1.0022 1.0071 1.0176 1.0254 1.0083 1.0053 0.9962 1.0050 0.9940 1.0021 1.0032
dispcorr: -0.025130543 hartree
energy: -2044.723613213332
dipole: 28.44409 -27.26934 1.17476 4.77102 -2.84015 1.93086 10.93814 -10.31655 0.62159
magnitude: 2.34407 au
magnitude: 5.95815 debye
