program: Gaussian 09
title: 000007470
version: EM64L-G09RevD.01
frameworkgroup: C1[X(C8H8O2)]
method: RPBEPBE
basis: SDD
operation: Freq
keyword: #p
keyword: freq=noraman
keyword: PBEPBE/SDD
title: #p freq=noraman PBEPBE/SDD
converged: NO YES NO NO
title: Mulliken charges:
elementType: O O C C C C C C C C H H H H H H H H
charge: -0.442467 -0.255624 0.448322 0.251055 -0.373416 -0.370033 -0.344258 -0.320879 -0.801743 0.113233 0.236380 0.235041 0.269680 0.272755 0.228895 0.228964 0.241213 0.382882
chargesum: 0.00000
title: Mulliken charges with hydrogens summed into heavy atoms:
elementType: O O C C C C C C C C
charge: -0.059585 -0.255624 0.448322 0.251055 -0.137036 -0.134992 -0.074578 -0.048124 -0.102671 0.113233
polarizability: 1.40372851e+02 -1.46391150e+00 9.50981544e+01 5.40344136e-01 -3.43534528e-03 4.19107882e+01
1716.lowfreq: -8.3452 -7.2230 0.0010 0.0011 0.0013 10.6868 15.3759 73.6881 101.7574
frequency: 13.7615 73.6835 101.7565 180.4994 266.0036 333.0615 340.2414 406.0448 468.5819 485.6082 558.1782 590.3787 633.2619 687.5635 691.1019 742.0566 803.2661 848.1141 861.3963 984.1912 984.7388 995.4335 1004.3783 1025.4040 1047.2296 1122.9906 1152.0308 1195.7919 1223.6699 1307.7324 1322.1211 1377.9159 1396.7676 1412.0413 1469.5304 1472.5178 1503.7418 1577.5070 1622.2631 1641.7301 2977.0892 3059.1562 3090.0565 3128.8480 3131.1549 3160.8747 3175.1436 3530.3565
redmass: 1.0279 6.7929 4.1859 5.2382 3.9813 3.1334 6.0252 2.8470 2.6236 5.7838 4.9917 1.2163 6.9729 3.7252 4.2299 2.9708 5.4194 1.5752 1.2515 1.3500 1.5265 1.3793 3.7490 2.7175 1.5993 1.2978 1.6834 1.1762 3.0515 1.3282 2.7394 4.9515 1.2224 3.5682 1.1052 1.0566 2.7102 6.4737 6.3194 8.5125 1.0391 1.0942 1.1001 1.0896 1.0896 1.0957 1.0952 1.0641
irintensity: 0.6060 0.8854 0.7118 1.0984 0.0190 0.7318 5.7185 0.4010 39.5299 11.8325 33.5704 87.3057 0.9467 58.0204 14.5619 34.3451 0.2385 35.0995 0.7651 6.6159 26.6882 0.4244 135.0772 127.8452 19.8781 7.9167 124.1644 3.4353 1.0777 12.7788 100.9599 5.0357 14.0572 11.0086 14.9793 13.4114 14.1530 18.8925 69.0228 297.7182 23.1835 20.9970 16.1717 16.8594 11.5832 6.6628 2.3728 43.7761
temp: 298.150 k
press: 1.00000 atm
elementType: 8 8 6 6 6 6 6 6 6 6 1 1 1 1 1 1 1 1
symmnumber: 1
zpe: 365919.5 jmol-1
zpe.correction: 0.139371 hartree
zpe.thermalcorrener: 0.148620 hartree
zpe.thermalcorrenthalpy: 0.149564 hartree
zpe.thermalcorrgfe: 0.103206 hartree
zpe.sumelectzpe: -459.395263 hartree
zpe.sumelectthermal: -459.386015 hartree
zpe.sumelectthermalent: -459.385071 hartree
zpe.sumelectthermalfe: -459.431429 hartree
dipole: 2.4254 -1.3823 0.0683
dipole: 2.7925
quadrupole: -49.4965 -56.6950 -61.0123
quadrupole: 6.5952 0.2305 -0.0180
quadrupole: 6.2381 -0.9604 -5.2777 6.5952 0.2305 -0.0180
hfenergy: -459.5346348 hartree
pointgroup: C01 [X(C8H8O2)]
dipole: 0.9625982 -0.5290305 0.0243405 debye
dipolederiv: -0.7271491 -0.4580655 -0.0000268 -0.6242883 -0.9714593 0.0014169 0.0012864 0.0021367 -0.4300509 -1.0297616 0.2944965 0.0020721 0.2641299 -0.8198766 -0.000319 0.0037518 -0.00205 -0.3378174 0.5592429 -0.0052653 0.0233405 0.0021228 0.0694439 0.0000398 0.0923952 -0.000455 -0.0069062 -0.8230168 -0.0094552 -0.0027949 0.0016055 -0.0831488 -0.0001042 0.0040504 -0.00012 -0.0087102 -0.3075279 0.1615584 -0.0010094 0.2674398 0.0372361 0.007097 -0.007028 0.004341 -0.1736665 -0.3309164 -0.1502056 -0.0010505 -0.2740776 0.0454531 -0.0069311 -0.0074349 -0.0048567 -0.1756125 0.1932724 -0.0941671 0.0014485 0.1526493 0.0312399 -0.0046412 -0.0084637 -0.0009647 -0.1049491 0.217476 0.0886355 0.0013421 -0.1396893 0.0243391 0.004686 -0.0088538 0.0016725 -0.1056871 -0.2282513 0.0028585 -0.0204151 0.0060886 0.0778671 0.0000985 -0.1612952 0.0020031 0.053082 2.0801726 0.0745873 -0.004854 0.1959417 1.3900905 -0.0001729 -0.0090342 0.0004566 0.2326116 0.0112404 -0.0996702 0.0035632 -0.0955467 -0.0500963 -0.0010962 0.0066998 0.0038648 0.1515644 0.012486 0.0991618 0.0036209 0.0969634 -0.0545521 0.0008157 0.0068184 -0.0040493 0.1502598 0.0828214 0.0765803 0.0008328 0.0457342 0.0113566 0.0004825 0.0030559 0.0008509 0.1561653 0.087517 -0.0619121 0.0008338 -0.0598781 0.0075832 -0.0006004 0.0029048 -0.0011786 0.1587556 0.0220507 0.0234331 0.0225083 0.0927583 -0.0596433 -0.1009721 0.0851974 -0.0798513 0.0637289 0.0220558 -0.0239059 0.0222105 -0.0974019 -0.0632833 0.0974531 0.0832513 0.0756791 0.0681236 -0.0226643 0.0015506 -0.0531191 0.000902 0.1157886 0.0035213 -0.0886486 0.0029603 -0.0911163 0.1809522 0.0797851 0.0014971 0.1645464 0.2916616 -0.0007736 0.0013469 -0.0004393 0.4002252 unknown
polarizability: 140.4093205|-0.7637167|95.0637117|0.3012085|0.0280579|41.908761 unknown
InChI: InChI=1S/C8H8O2/c1-6-2-4-7(5-3-6)8(9)10/h2-5,9H,1H3
charge 0 multiplicity 1
18 atoms
O  -2.798798 -1.214032 0.010385
O  -2.906666 1.1048 0.012251
C  2.127136 -0.006391 -0.016588
C  -0.723349 0.005137 -0.000007
C  1.404333 1.217257 -0.014687
C  1.393412 -1.223001 -0.015944
C  -0.002979 1.228033 -0.004885
C  -0.01504 -1.224247 -0.006185
C  3.644092 -0.013296 0.005963
C  -2.206112 0.061896 0.00788
H  1.954218 2.165798 -0.022278
H  1.935636 -2.176037 -0.024524
H  -0.564837 2.167962 -0.004444
H  -0.576208 -2.162881 -0.006851
H  4.053989 -0.903091 -0.50289
H  4.061683 0.885963 -0.479283
H  4.02053 -0.028841 1.047559
H  -3.787041 -1.10153 0.015827
