program: Orca
programVersion: 4.2.1
elementType: Cl Cl O O O N N N C C C C C C C C C C C C C C C C C C C H H H H H H H H H H H H H H H H H
charge: 0
multiplicity: 1
keywords: wb97x-d3
keywords: def2-TZVPP
keywords: def2/J RIJCOSX GRIDX6 NOFINALGRIDX
keywords: grid4 nofinalgrid
keywords: scfconv7
keywords: smallprint printgap noloewdin
keywords: NOSOSCF
formula: C19H17Cl2N3O3
InChI: InChI=1/C19H17Cl2N3O3/c1-13-9-25-19(27-13,10-24-12-22-11-23-24)17-7-6-16(8-18(17)21)26-15-4-2-14(20)3-5-15/h2-8,11-13H,9-10H2,1H3
44 atoms
Cl 0.925239 1.87885 2.08366
Cl -6.927592 -0.674812 0.841052
O  3.951607 -0.146769 -0.588116
O  3.624158 1.432075 0.986431
O  -2.075701 1.133289 -1.901709
N  2.278416 -1.988859 0.847608
N  0.957726 -2.175932 0.917091
N  1.911201 -3.781133 -0.317875
C  3.054939 0.302676 0.385833
C  4.989777 0.816607 -0.760609
C  2.900477 -0.825395 1.425873
C  4.978304 1.52347 0.581529
C  1.70625 0.643304 -0.230526
C  6.285357 0.123492 -1.09794
C  0.687314 1.284711 0.472451
C  1.409182 0.205405 -1.516056
C  -0.572671 1.46783 -0.068843
C  0.152266 0.361884 -2.076507
C  -0.839385 0.981547 -1.339818
C  2.832954 -2.948924 0.101317
C  0.783879 -3.26044 0.20773
C  -3.172117 0.688474 -1.218756
C  -3.121289 -0.371403 -0.321289
C  -4.378279 1.319842 -1.490849
C  -4.280842 -0.788669 0.313593
C  -5.537674 0.895672 -0.863146
C  -5.481059 -0.152954 0.041722
H  4.715148 1.513921 -1.561287
H  2.290494 -0.503194 2.266353
H  3.883651 -1.100161 1.810308
H  5.643821 1.033786 1.303155
H  5.256875 2.575213 0.514352
H  7.081363 0.860857 -1.208559
H  6.576898 -0.575567 -0.312544
H  6.212312 -0.422761 -2.038386
H  2.170471 -0.298121 -2.094315
H  -1.340548 1.974435 0.501467
H  -0.054882 -0.007424 -3.072249
H  3.891586 -3.005771 -0.095968
H  -0.191929 -3.699456 0.068087
H  -2.192037 -0.883164 -0.104789
H  -4.413498 2.141807 -2.194248
H  -4.23771 -1.61155 1.014054
H  -6.474972 1.39136 -1.076311
elementType: Cl O N C H
totalener: -2044.69653371 hartree
nucrepener: 2778.99695126 hartree
electener: -4823.69348497 hartree
oneelecener: -8329.18742183 hartree
twoeener: 3505.49393686 hartree
cpcmener: -0.02807520 hartree
kineticenergy: 2038.69808245 hartree
xcener: -149.986700611981 hartree
chargesum: 0.0000000
charge: -0.079043 -0.102133 -0.398766 -0.369958 -0.324837 0.117413 -0.340286 -0.406522 0.601491 0.119206 -0.143593 0.036841 -0.124177 -0.269362 0.020081 -0.085592 -0.167153 -0.256769 0.251595 0.063358 0.066984 0.275242 -0.167970 -0.244678 -0.155494 -0.113964 0.073916 0.074476 0.128884 0.127740 0.073134 0.104907 0.098828 0.077330 0.098041 0.146728 0.135099 0.148837 0.167433 0.156289 0.149363 0.148419 0.143652 0.145012
qa: -0.0790 -0.1021 -0.3988 -0.3700 -0.3248 0.1174 -0.3403 -0.4065 0.6015 0.1192 -0.1436 0.0368 -0.1242 -0.2694 0.0201 -0.0856 -0.1672 -0.2568 0.2516 0.0634 0.0670 0.2752 -0.1680 -0.2447 -0.1555 -0.1140 0.0739 0.0745 0.1289 0.1277 0.0731 0.1049 0.0988 0.0773 0.0980 0.1467 0.1351 0.1488 0.1674 0.1563 0.1494 0.1484 0.1437 0.1450
va: 1.2448 1.2013 1.9834 2.0065 2.0788 3.3457 2.8528 3.0437 3.7978 3.9393 3.9312 3.9613 3.7026 3.9596 3.9607 3.7943 4.0372 4.1033 3.7763 4.0755 4.0269 3.7096 3.9078 4.0236 4.0082 3.9652 3.8328 1.0002 1.0299 1.0070 0.9977 0.9934 1.0047 1.0100 1.0026 1.0236 1.0186 1.0059 1.0034 0.9969 1.0033 1.0064 1.0053 1.0018
dispcorr: -0.025537103 hartree
energy: -2044.722070812766
dipole: 35.03312 -32.32942 2.70369 -2.09331 3.14539 1.05208 -9.96486 9.53107 -0.43379
magnitude: 2.93343 au
magnitude: 7.45618 debye
