program: Orca
programVersion: 5.0.4
elementType: C C C C C N C C C C H H H C N C C H C O C O N N C H H H C H H H C H H H C H H H Yb N O O O N O O O N O O O C H H H C H H H
elementType: Yb
keywords: def2-SVPD def2/JK def2/J def2-SVPD/C PBE rijcosx rhf hcore XYZFile VeryTightSCF freq cpcm(water) D3 defgrid3
charge: 0
multiplicity: 1
frequency: 0.00 0.00 0.00 0.00 0.00 0.00 14.01 24.54 32.79 35.37 36.53 43.11 53.31 58.42 69.61 75.07 77.98 83.84 92.48 95.55 105.86 111.66 113.88 120.50 125.06 127.50 138.05 147.53 154.34 154.67 156.95 165.39 171.19 172.78 175.68 179.09 183.57 187.95 189.30 196.30 201.42 204.89 216.67 223.90 238.27 243.17 255.97 272.24 276.92 284.94 308.02 319.19 324.77 343.50 354.78 380.91 423.90 435.93 458.90 464.27 501.69 503.31 522.44 531.93 543.70 581.42 599.19 610.25 632.20 647.86 664.10 696.55 699.98 702.08 702.58 713.71 714.63 729.27 737.30 739.62 745.01 759.80 768.87 796.68 797.39 799.11 832.48 863.35 867.95 881.67 887.25 889.45 907.98 959.82 978.23 979.69 991.14 1003.33 1009.59 1012.76 1023.46 1045.28 1047.70 1058.38 1060.27 1061.96 1072.10 1072.90 1115.35 1117.12 1122.91 1133.24 1147.76 1160.42 1183.02 1203.66 1244.33 1245.18 1249.17 1272.26 1288.12 1297.08 1306.21 1316.67 1324.49 1334.50 1345.45 1346.88 1371.84 1375.55 1377.28 1382.32 1384.68 1392.58 1393.58 1394.33 1395.78 1399.00 1401.30 1404.19 1412.04 1412.32 1412.61 1414.29 1417.43 1422.48 1426.29 1455.91 1462.09 1471.26 1473.97 1475.05 1491.70 1503.93 1511.37 1562.23 1577.04 1598.62 1612.76 1615.83 1620.52 2974.66 2975.25 2975.43 2975.90 2979.26 2979.99 3047.47 3048.04 3059.14 3061.26 3065.18 3065.63 3091.47 3092.58 3111.67 3115.45 3117.65 3118.69 3139.89 3150.96 3155.25 3162.27
frequency: 14.01 24.54 32.79 35.37 36.53 43.11 53.31 58.42 69.61 75.07 77.98 83.84 92.48 95.55 105.86 111.66 113.88 120.50 125.06 127.50 138.05 147.53 154.34 154.67 156.95 165.39 171.19 172.78 175.68 179.09 183.57 187.95 189.30 196.30 201.42 204.89 216.67 223.90 238.27 243.17 255.97 272.24 276.92 284.94 308.02 319.19 324.77 343.50 354.78 380.91 423.90 435.93 458.90 464.27 501.69 503.31 522.44 531.93 543.70 581.42 599.19 610.25 632.20 647.86 664.10 696.55 699.98 702.08 702.58 713.71 714.63 729.27 737.30 739.62 745.01 759.80 768.87 796.68 797.39 799.11 832.48 863.35 867.95 881.67 887.25 889.45 907.98 959.82 978.23 979.69 991.14 1003.33 1009.59 1012.76 1023.46 1045.28 1047.70 1058.38 1060.27 1061.96 1072.10 1072.90 1115.35 1117.12 1122.91 1133.24 1147.76 1160.42 1183.02 1203.66 1244.33 1245.18 1249.17 1272.26 1288.12 1297.08 1306.21 1316.67 1324.49 1334.50 1345.45 1346.88 1371.84 1375.55 1377.28 1382.32 1384.68 1392.58 1393.58 1394.33 1395.78 1399.00 1401.30 1404.19 1412.04 1412.32 1412.61 1414.29 1417.43 1422.48 1426.29 1455.91 1462.09 1471.26 1473.97 1475.05 1491.70 1503.93 1511.37 1562.23 1577.04 1598.62 1612.76 1615.83 1620.52 2974.66 2975.25 2975.43 2975.90 2979.26 2979.99 3047.47 3048.04 3059.14 3061.26 3065.18 3065.63 3091.47 3092.58 3111.67 3115.45 3117.65 3118.69 3139.89 3150.96 3155.25 3162.27
formula: C20H22N7O11Yb
InChI: InChI=1/C20H22N4O2.3NO3.Yb/c1-11-9-15(19(25)23(3)4)21-17-13(11)7-8-14-12(2)10-16(22-18(14)17)20(26)24(5)6;3*2-1(3)4;/h7-10H,1-6H3;;;;/q-4;3*-2;+10/rC20H22N7O11Yb/c1-11-9-15-19(21(3)4)31-39(25(28,33-39)34-39,26(29,35-39)36-39,27(30,37-39)38-39)23(15)17-13(11)7-8-14-12(2)10-16(24(39)18(14)17)20(32-39)22(5)6/h7-10H,1-6H3
61 atoms
C  -0.480113 -0.45665 -4.073707
C  -0.565885 0.926928 -4.264813
C  -0.458416 -0.944466 -2.728664
C  -0.661848 1.798699 -3.158235
C  -0.531763 0.013576 -1.676913
N  -0.646835 1.339833 -1.90082
C  -0.320805 -2.332556 -2.379798
C  -0.20187 -2.735921 -1.06774
C  -0.210596 -1.786584 0.011397
C  -0.404814 -0.410009 -0.298601
H  -0.5241 1.324758 -5.284203
H  -0.291557 -3.083591 -3.178692
H  -0.081048 -3.802041 -0.840245
C  0.010777 -2.13003 1.382635
N  -0.420527 0.557857 0.638792
C  -0.255529 0.236169 1.925559
C  -0.009989 -1.097474 2.326385
H  0.199478 -1.338739 3.373105
C  -0.608866 3.307212 -3.197296
O  -0.09025 3.873737 -2.189137
C  -0.234715 1.470872 2.79476
O  0.02068 2.563941 2.206477
N  -1.059717 4.011251 -4.245376
N  -0.458247 1.431484 4.117665
C  -1.932195 3.491174 -5.296582
H  -1.376339 3.353157 -6.244035
H  -2.399017 2.544344 -4.987382
H  -2.734902 4.230932 -5.465381
C  -0.834952 5.45514 -4.274242
H  0.049928 5.708265 -3.670981
H  -0.679197 5.762096 -5.323089
H  -1.718527 5.988702 -3.871873
C  -1.050784 0.311201 4.846525
H  -1.610393 -0.350171 4.168091
H  -0.278799 -0.264849 5.39267
H  -1.761606 0.726763 5.582256
C  -0.253773 2.648954 4.901676
H  -1.21494 3.180928 5.043945
H  0.145665 2.361893 5.890252
H  0.456559 3.311122 4.384581
Yb -0.598707 2.973161 -0.042216
N  2.286278 3.270742 -0.017627
O  3.512504 3.395988 -0.000446
O  1.502027 4.221513 0.318955
O  1.722456 2.180422 -0.373633
N  -3.424206 2.5219 -0.708886
O  -4.611844 2.368344 -1.006807
O  -2.712216 3.445184 -1.238044
O  -2.832134 1.774167 0.134493
N  -1.937232 5.33433 1.075069
O  -2.513774 6.335461 1.510816
O  -2.211228 4.160371 1.492442
O  -1.031237 5.413419 0.177489
C  -0.376551 -1.391022 -5.240757
H  0.568197 -1.968194 -5.19774
H  -1.201755 -2.130013 -5.223087
H  -0.413323 -0.841645 -6.195619
C  0.280879 -3.546058 1.793714
H  -0.567942 -4.202512 1.517455
H  1.172897 -3.942575 1.269884
H  0.444871 -3.620992 2.881226
elementType: C N H O Yb
totalener: -2022.13045029 hartree
nucrepener: 5103.66179907 hartree
electener: -7125.79224937 hartree
twoeener: 5818.16371456 hartree
cpcmener: -0.09759417 hartree
kineticenergy: 1976.02460092 hartree
exchangeener: -251.984915058449 hartree
correlationener: -9.916032601931 hartree
xcener: -261.900947660380 hartree
chargesum: 0.0000000
charge: -0.794055 -0.274895 -0.611116 -0.162555 -0.197420 0.143949 -0.660815 -0.698847 -0.695340 0.110859 -0.095684 0.846426 0.886480 -0.829203 -0.122694 -0.050675 -0.311752 -0.111980 0.891608 -0.887120 0.918255 -1.041513 -1.422283 -1.350339 0.916192 0.137886 -0.007567 -0.197387 1.040572 -0.109954 -0.082587 0.060495 0.860641 0.051986 0.160420 -0.243344 1.018815 0.039801 -0.038933 -0.124952 2.774623 0.561039 -0.441800 -0.547608 -0.522469 0.543093 -0.457265 -0.498718 -0.504893 0.559987 -0.457833 -0.526700 -0.528668 1.092749 0.283557 0.297767 -0.125221 1.077691 0.295733 0.289003 -0.125446
charge: -0.108497 0.134528 -0.038506 -0.008026 0.000716 -0.047172 0.088384 0.088175 -0.038409 -0.004683 0.026850 0.029187 0.029257 -0.110014 -0.056151 -0.002571 0.134818 0.021270 -0.038375 -0.299101 -0.008933 -0.302632 -0.198629 -0.200751 0.241764 0.025855 0.005687 0.021541 0.249277 0.003902 0.021369 0.030335 0.240626 0.006860 0.026119 0.020242 0.247717 0.029687 0.021996 0.002918 1.498110 -0.367910 -0.042440 -0.168654 -0.165538 -0.362831 -0.046759 -0.161834 -0.161155 -0.370190 -0.050832 -0.154256 -0.165652 0.160417 0.025566 0.024952 0.006904 0.159729 0.024891 0.024399 0.006453
qa: -0.7941 -0.2749 -0.6111 -0.1626 -0.1974 0.1439 -0.6608 -0.6988 -0.6953 0.1109 -0.0957 0.8464 0.8865 -0.8292 -0.1227 -0.0507 -0.3118 -0.1120 0.8916 -0.8871 0.9183 -1.0415 -1.4223 -1.3503 0.9162 0.1379 -0.0076 -0.1974 1.0406 -0.1100 -0.0826 0.0605 0.8606 0.0520 0.1604 -0.2433 1.0188 0.0398 -0.0389 -0.1250 2.7746 0.5610 -0.4418 -0.5476 -0.5225 0.5431 -0.4573 -0.4987 -0.5049 0.5600 -0.4578 -0.5267 -0.5287 1.0927 0.2836 0.2978 -0.1252 1.0777 0.2957 0.2890 -0.1254
va: 5.6317 3.6405 4.7348 4.3360 5.1476 4.9107 4.7636 4.6435 4.8115 4.8623 1.4675 0.8661 0.7931 5.3642 5.1401 4.1959 3.7158 1.5675 3.0844 1.5532 2.8018 1.6292 5.5292 5.4182 3.7596 0.8061 1.0354 0.9403 3.5912 1.1036 0.9092 0.8410 3.8089 0.9714 0.8071 0.9779 3.5849 0.8647 0.9028 1.1319 0.2102 4.0576 1.7740 1.4536 1.4288 4.1171 1.7740 1.1795 1.4807 4.0652 1.7715 1.3197 1.4166 3.5075 0.8774 0.8942 1.2498 3.5208 0.8854 0.8852 1.2609
dispersion: -0.090660684 hartree
energy: -2022.221110978586 hartree
dipole: -5.67512 6.45848 0.78336 -161.24875 151.81737 -9.43138 -49.06918 46.64161 -2.42757
magnitude: 9.77025 au
magnitude: 24.83399 debye
temp: 298.15 k
press: 1.00 atm
zeropoint: 0.43123193 hartree
thermalvibcorrection: 0.03743016 hartree
thermalrotcorrection: 0.00141627 hartree
thermaltrasncorrection: 0.00141627 hartree
thermaltotal: -2021.74961634 hartree
thermalcorr: 0.04026271 hartree
nonthermalcorr: 0.43123193 hartree
totalcorr: 0.47149464 hartree
thermalcorrenthalpy: 0.00094421 hartree
totalenthalpy: -2021.74867213 hartree
vibrat: 0.06901536 hartree
rotat: 0.01774982 hartree
transl: 0.02164622 hartree
total: 0.10841140 hartree
totalentropycorr: -0.10841140 hartree
gibbsenthalpy: -2021.85708353 hartree
gibbsminuselec: 0.36402745 hartree
