program: Orca
programVersion: 4.2.1
elementType: Cl Cl O O O N N N C C C C C C C C C C C C C C C C C C C H H H H H H H H H H H H H H H H H
charge: 0
multiplicity: 1
keywords: wb97x-d3
keywords: def2-TZVPP
keywords: def2/J RIJCOSX GRIDX6 NOFINALGRIDX
keywords: grid4 nofinalgrid
keywords: scfconv7
keywords: smallprint printgap noloewdin
keywords: NOSOSCF
formula: C19H17Cl2N3O3
InChI: InChI=1/C19H17Cl2N3O3/c1-13-9-25-19(27-13,10-24-12-22-11-23-24)17-7-6-16(8-18(17)21)26-15-4-2-14(20)3-5-15/h2-8,11-13H,9-10H2,1H3
44 atoms
Cl 2.05628 1.007461 3.067878
Cl -6.631999 1.08274 -2.89724
O  3.358204 -0.014405 -1.13704
O  3.802355 1.222554 0.666165
O  -2.501165 0.341066 1.187582
N  2.910241 -2.306272 0.753041
N  2.902221 -2.95274 -0.41394
N  1.442538 -3.882782 1.008296
C  3.106736 0.095414 0.235368
C  3.849305 1.23337 -1.634241
C  3.699332 -1.121471 0.96041
C  3.747048 2.140496 -0.40973
C  1.603218 0.212794 0.485032
C  5.258903 1.06253 -2.156509
C  1.056829 0.596471 1.709033
C  0.702996 -0.139378 -0.515774
C  -0.31013 0.658328 1.917843
C  -0.669263 -0.102058 -0.333329
C  -1.174934 0.305986 0.891805
C  2.028016 -2.86321 1.585779
C  2.013916 -3.89167 -0.21189
C  -3.424886 0.514798 0.191971
C  -3.347784 1.584317 -0.690238
C  -4.484054 -0.376738 0.129793
C  -4.335783 1.755595 -1.64617
C  -5.480631 -0.199383 -0.818597
C  -5.395637 0.862519 -1.704184
H  3.190847 1.578713 -2.435883
H  3.744713 -0.934769 2.031507
H  4.714898 -1.298388 0.607735
H  4.575914 2.841532 -0.314465
H  2.8090 2.706873 -0.399774
H  5.301523 0.298483 -2.934117
H  5.612688 1.99737 -2.59509
H  5.952168 0.781248 -1.360283
H  1.078219 -0.466951 -1.474489
H  -0.708216 0.970321 2.874548
H  -1.318734 -0.401944 -1.144843
H  1.858575 -2.503065 2.588554
H  1.767825 -4.613395 -0.975011
H  -2.530219 2.292394 -0.63911
H  -4.539007 -1.205805 0.823529
H  -4.276225 2.588454 -2.333268
H  -6.308717 -0.894124 -0.863629
elementType: Cl O N C H
totalener: -2044.69759301 hartree
nucrepener: 2755.41988154 hartree
electener: -4800.11747455 hartree
oneelecener: -8281.75141157 hartree
twoeener: 3481.63393703 hartree
cpcmener: -0.03037196 hartree
kineticenergy: 2038.69757625 hartree
xcener: -149.986385622497 hartree
chargesum: 0.0000000
charge: -0.077946 -0.097717 -0.395449 -0.356966 -0.321298 0.128875 -0.348452 -0.400765 0.605093 0.155788 -0.145536 0.009876 -0.189006 -0.299175 0.012206 -0.123726 -0.205823 -0.203158 0.274573 0.070360 0.060178 0.267957 -0.189376 -0.234928 -0.126572 -0.110974 0.069444 0.082971 0.139447 0.122902 0.108385 0.090863 0.094703 0.093778 0.088498 0.146111 0.127141 0.152910 0.164145 0.160267 0.158067 0.150383 0.146182 0.145765
qa: -0.0779 -0.0977 -0.3954 -0.3570 -0.3213 0.1289 -0.3485 -0.4008 0.6051 0.1558 -0.1455 0.0099 -0.1890 -0.2992 0.0122 -0.1237 -0.2058 -0.2032 0.2746 0.0704 0.0602 0.2680 -0.1894 -0.2349 -0.1266 -0.1110 0.0694 0.0830 0.1394 0.1229 0.1084 0.0909 0.0947 0.0938 0.0885 0.1461 0.1271 0.1529 0.1641 0.1603 0.1581 0.1504 0.1462 0.1458
va: 1.2416 1.2057 1.9809 2.0117 2.0867 3.3420 2.8866 3.0344 3.8128 3.8741 3.9076 3.9536 3.6502 3.9731 3.9551 3.8943 4.1113 3.9914 3.7907 4.0590 4.0531 3.7106 3.9691 4.0404 3.9594 3.9483 3.8460 0.9981 1.0102 1.0227 0.9936 1.0022 1.0059 1.0063 1.0055 1.0315 1.0273 0.9997 0.9989 0.9960 0.9949 1.0045 1.0030 1.0019
dispcorr: -0.025251142 hartree
energy: -2044.722844149404
dipole: 25.34614 -24.65184 0.69430 0.58846 1.16305 1.75151 -8.34466 8.02201 -0.32265
magnitude: 1.91153 au
magnitude: 4.85873 debye
