program: Orca
programVersion: 5.0.4
elementType: C C C C C N C C C C H H H C N C C H C O C O N N C H H H C H H H C H H H C H H H Er N O O O N O O O N O O O C H H H C H H H
elementType: Er
keywords: def2-SVPD def2/JK def2/J def2-SVPD/C PBE rijcosx rhf hcore XYZFile VeryTightSCF freq cpcm(water) D3 defgrid3
charge: 0
multiplicity: 1
frequency: 0.00 0.00 0.00 0.00 0.00 0.00 15.53 24.05 30.19 34.51 35.81 42.24 51.77 56.01 71.18 76.02 77.75 82.44 91.51 97.99 104.81 108.33 112.37 117.29 123.55 126.06 134.54 147.56 150.54 153.21 158.97 165.69 171.30 172.10 175.63 179.45 182.49 185.68 190.39 193.10 199.92 204.65 213.25 224.10 237.82 242.37 254.40 271.20 276.06 283.69 305.48 318.27 324.36 343.43 353.54 379.75 421.38 434.40 457.82 462.64 500.65 502.78 522.00 532.38 541.44 580.19 600.64 609.76 631.94 648.16 663.38 696.55 700.48 702.45 702.83 713.88 714.29 728.98 736.29 738.73 743.94 759.67 768.39 797.45 797.78 799.06 832.69 862.61 867.19 881.52 887.17 889.45 907.45 959.51 978.24 979.58 991.35 1003.32 1009.64 1012.71 1023.39 1044.82 1047.49 1056.82 1059.06 1060.87 1072.13 1073.04 1115.23 1117.24 1122.87 1132.89 1147.98 1159.45 1182.01 1202.80 1243.84 1244.92 1249.05 1272.54 1284.88 1293.48 1303.66 1316.57 1324.49 1334.55 1345.40 1346.73 1371.84 1375.21 1377.19 1382.62 1385.05 1392.66 1393.67 1394.17 1395.74 1398.47 1401.06 1403.97 1411.31 1412.40 1412.85 1414.58 1417.27 1422.09 1425.87 1455.90 1461.29 1471.89 1474.65 1475.28 1491.72 1504.46 1511.58 1562.12 1577.24 1598.60 1612.04 1616.24 1620.60 2974.61 2975.23 2975.45 2976.09 2979.26 2980.11 3047.42 3048.00 3058.18 3060.90 3064.75 3065.20 3091.61 3092.61 3111.46 3114.91 3117.47 3119.49 3140.04 3151.11 3152.29 3160.58
frequency: 15.53 24.05 30.19 34.51 35.81 42.24 51.77 56.01 71.18 76.02 77.75 82.44 91.51 97.99 104.81 108.33 112.37 117.29 123.55 126.06 134.54 147.56 150.54 153.21 158.97 165.69 171.30 172.10 175.63 179.45 182.49 185.68 190.39 193.10 199.92 204.65 213.25 224.10 237.82 242.37 254.40 271.20 276.06 283.69 305.48 318.27 324.36 343.43 353.54 379.75 421.38 434.40 457.82 462.64 500.65 502.78 522.00 532.38 541.44 580.19 600.64 609.76 631.94 648.16 663.38 696.55 700.48 702.45 702.83 713.88 714.29 728.98 736.29 738.73 743.94 759.67 768.39 797.45 797.78 799.06 832.69 862.61 867.19 881.52 887.17 889.45 907.45 959.51 978.24 979.58 991.35 1003.32 1009.64 1012.71 1023.39 1044.82 1047.49 1056.82 1059.06 1060.87 1072.13 1073.04 1115.23 1117.24 1122.87 1132.89 1147.98 1159.45 1182.01 1202.80 1243.84 1244.92 1249.05 1272.54 1284.88 1293.48 1303.66 1316.57 1324.49 1334.55 1345.40 1346.73 1371.84 1375.21 1377.19 1382.62 1385.05 1392.66 1393.67 1394.17 1395.74 1398.47 1401.06 1403.97 1411.31 1412.40 1412.85 1414.58 1417.27 1422.09 1425.87 1455.90 1461.29 1471.89 1474.65 1475.28 1491.72 1504.46 1511.58 1562.12 1577.24 1598.60 1612.04 1616.24 1620.60 2974.61 2975.23 2975.45 2976.09 2979.26 2980.11 3047.42 3048.00 3058.18 3060.90 3064.75 3065.20 3091.61 3092.61 3111.46 3114.91 3117.47 3119.49 3140.04 3151.11 3152.29 3160.58
formula: C20H22ErN7O11
InChI: InChI=1/C20H22N4O2.Er.3NO3/c1-11-9-15(19(25)23(3)4)21-17-13(11)7-8-14-12(2)10-16(22-18(14)17)20(26)24(5)6;;3*2-1(3)4/h7-10H,1-6H3;;;;/q-4;+10;3*-2/rC20H22ErN7O11/c1-11-9-15-19(22(3)4)32-21(34-26(29)35-21,36-27(30)37-21,38-28(31)39-21)24(15)17-13(11)7-8-14-12(2)10-16(25(21)18(14)17)20(33-21)23(5)6/h7-10H,1-6H3
61 atoms
C  -0.467716 -0.453025 -4.076127
C  -0.562472 0.929607 -4.26785
C  -0.438586 -0.939133 -2.730484
C  -0.656515 1.80059 -3.16086
C  -0.511769 0.018947 -1.678277
N  -0.632159 1.344854 -1.902687
C  -0.294418 -2.326701 -2.382897
C  -0.173749 -2.730577 -1.07137
C  -0.186668 -1.782216 0.00835
C  -0.383035 -0.40523 -0.300003
H  -0.528305 1.329092 -5.287215
H  -0.262753 -3.076923 -3.182445
H  -0.048702 -3.796352 -0.844606
C  0.031064 -2.128591 1.379443
N  -0.403284 0.560982 0.639316
C  -0.24688 0.234762 1.925898
C  0.000556 -1.098726 2.325453
H  0.20428 -1.340447 3.373324
C  -0.609309 3.308496 -3.208229
O  -0.058205 3.8812 -2.221387
C  -0.239765 1.462293 2.804617
O  0.035872 2.559415 2.233363
N  -1.101732 4.003518 -4.243382
N  -0.499415 1.410271 4.120549
C  -2.009721 3.470391 -5.257342
H  -1.491851 3.342002 -6.227288
H  -2.447455 2.515692 -4.930334
H  -2.830811 4.19715 -5.391628
C  -0.888288 5.448512 -4.289197
H  0.014071 5.711476 -3.716821
H  -0.769047 5.749568 -5.344573
H  -1.762007 5.978628 -3.861599
C  -1.115257 0.284337 4.821065
H  -1.654788 -0.370236 4.120151
H  -0.360931 -0.297429 5.385353
H  -1.847587 0.694558 5.538545
C  -0.313216 2.617776 4.923887
H  -1.280021 3.140914 5.060329
H  0.074117 2.319714 5.914168
H  0.399553 3.291657 4.425872
Er -0.560446 3.004311 -0.036615
N  2.345976 3.268204 0.003872
O  3.57304 3.37895 0.032726
O  1.570964 4.227858 0.340264
O  1.773045 2.186609 -0.36436
N  -3.415194 2.578435 -0.645189
O  -4.611237 2.43086 -0.908714
O  -2.703639 3.470396 -1.225431
O  -2.814639 1.853197 0.213616
N  -1.841096 5.457222 1.008073
O  -2.399835 6.480616 1.414942
O  -2.113205 4.304697 1.485992
O  -0.959927 5.489974 0.084866
C  -0.364378 -1.387922 -5.242721
H  0.583675 -1.959924 -5.203347
H  -1.185466 -2.131366 -5.220872
H  -0.408233 -0.83945 -6.197797
C  0.304523 -3.544612 1.788168
H  -0.541371 -4.203222 1.50803
H  1.199316 -3.93712 1.266078
H  0.465462 -3.621242 2.876015
elementType: C N H O Er
totalener: -2020.96688792 hartree
nucrepener: 5087.86596816 hartree
electener: -7108.83285608 hartree
twoeener: 5801.56744733 hartree
cpcmener: -0.09754738 hartree
kineticenergy: 1975.40552764 hartree
exchangeener: -251.860930961403 hartree
correlationener: -9.911763553142 hartree
xcener: -261.772694514545 hartree
chargesum: -0.0000000
charge: -0.798578 -0.254653 -0.592162 -0.161401 -0.248685 0.147664 -0.669449 -0.684708 -0.686561 0.087049 -0.092641 0.846709 0.905750 -0.837550 -0.116133 -0.077229 -0.290492 -0.114805 0.876908 -0.913589 0.909460 -1.052741 -1.437921 -1.360192 0.928547 0.125178 -0.016016 -0.183999 1.053119 -0.110630 -0.083197 0.059542 0.864161 0.052187 0.153521 -0.240029 1.021192 0.038965 -0.032898 -0.132558 2.968747 0.557198 -0.440345 -0.574792 -0.554230 0.538616 -0.453980 -0.511143 -0.522491 0.553136 -0.455664 -0.541139 -0.521942 1.088061 0.284741 0.298714 -0.128342 1.073106 0.296837 0.290828 -0.127049
charge: -0.109262 0.133228 -0.039131 -0.010198 0.001654 -0.046018 0.087577 0.087405 -0.039080 -0.003305 0.028501 0.028964 0.029063 -0.110742 -0.053714 -0.004143 0.133538 0.021962 -0.040546 -0.297577 -0.009678 -0.302579 -0.199266 -0.201299 0.241006 0.025203 0.005341 0.021427 0.248530 0.003918 0.020999 0.029773 0.239741 0.006885 0.025640 0.019964 0.246918 0.029299 0.021962 0.002322 1.502760 -0.368073 -0.041357 -0.166637 -0.164343 -0.362361 -0.045330 -0.159368 -0.161441 -0.371264 -0.052156 -0.155468 -0.161657 0.160067 0.025560 0.024905 0.006822 0.159494 0.024867 0.024324 0.006379
qa: -0.7986 -0.2547 -0.5922 -0.1614 -0.2487 0.1477 -0.6694 -0.6847 -0.6866 0.0870 -0.0926 0.8467 0.9058 -0.8376 -0.1161 -0.0772 -0.2905 -0.1148 0.8769 -0.9136 0.9095 -1.0527 -1.4379 -1.3602 0.9285 0.1252 -0.0160 -0.1840 1.0531 -0.1106 -0.0832 0.0595 0.8642 0.0522 0.1535 -0.2400 1.0212 0.0390 -0.0329 -0.1326 2.9687 0.5572 -0.4403 -0.5748 -0.5542 0.5386 -0.4540 -0.5111 -0.5225 0.5531 -0.4557 -0.5411 -0.5219 1.0881 0.2847 0.2987 -0.1283 1.0731 0.2968 0.2908 -0.1270
va: 5.6947 3.6380 4.7175 4.3822 5.2358 4.9095 4.7767 4.6499 4.8115 4.9016 1.4441 0.8633 0.7477 5.4261 5.1111 4.2814 3.7117 1.5418 3.1227 1.5801 2.8534 1.6983 5.5491 5.4377 3.7494 0.8151 1.0467 0.9316 3.5890 1.1046 0.9064 0.8388 3.8055 0.9771 0.8114 0.9734 3.5898 0.8639 0.9000 1.1322 -0.1844 4.0599 1.7790 1.4365 1.4617 4.1126 1.7780 1.1838 1.4831 4.0752 1.7662 1.3113 1.4182 3.5226 0.8744 0.8910 1.2482 3.5298 0.8825 0.8823 1.2603
dispersion: -0.090321008 hartree
energy: -2021.057208924248 hartree
dipole: -8.76591 9.30635 0.54044 -159.11504 149.49195 -9.62310 -48.18232 45.74484 -2.43748
magnitude: 9.94170 au
magnitude: 25.26979 debye
temp: 298.15 k
press: 1.00 atm
zeropoint: 0.43103308 hartree
thermalvibcorrection: 0.03751967 hartree
thermalrotcorrection: 0.00141627 hartree
thermaltrasncorrection: 0.00141627 hartree
thermaltotal: -2020.58582363 hartree
thermalcorr: 0.04035222 hartree
nonthermalcorr: 0.43103308 hartree
totalcorr: 0.47138529 hartree
thermalcorrenthalpy: 0.00094421 hartree
totalenthalpy: -2020.58487942 hartree
vibrat: 0.06924352 hartree
rotat: 0.01775906 hartree
transl: 0.02163463 hartree
total: 0.10863722 hartree
totalentropycorr: -0.10863722 hartree
gibbsenthalpy: -2020.69351664 hartree
gibbsminuselec: 0.36369229 hartree
