program: Orca
programVersion: 5.0.4
elementType: C C C C C N C C C C H H H C N C C H C O C O N N C H H H C H H H C H H H C H H H Sm N O O O N O O O N O O O C H H H C H H H
elementType: Sm
keywords: def2-SVPD def2/JK def2/J def2-SVPD/C PBE rijcosx rhf hcore XYZFile VeryTightSCF freq cpcm(water) D3 defgrid3
charge: 0
multiplicity: 1
frequency: 0.00 0.00 0.00 0.00 0.00 0.00 18.56 24.75 31.77 33.31 37.10 40.34 46.43 49.32 71.39 74.10 78.70 84.27 85.29 91.58 96.43 102.66 105.68 108.39 111.97 120.70 123.46 131.59 137.77 155.67 162.58 165.34 168.18 173.84 174.53 178.56 184.12 186.19 189.45 196.64 199.63 202.66 209.37 222.18 237.18 242.05 251.85 270.84 276.13 282.38 300.66 320.00 322.78 344.25 352.23 376.93 419.54 432.82 455.33 458.69 499.52 502.28 521.04 533.14 537.19 577.32 602.78 608.70 631.74 649.30 661.48 697.14 702.38 703.87 703.92 712.51 714.90 727.72 732.21 734.87 739.32 760.75 768.13 798.51 798.69 799.97 833.22 864.08 872.39 881.96 889.13 894.33 905.86 958.72 977.65 979.04 993.89 1003.26 1009.91 1012.86 1022.55 1045.16 1047.15 1052.86 1056.16 1057.82 1072.30 1073.21 1114.48 1117.56 1122.79 1131.98 1148.97 1158.32 1181.37 1201.81 1243.29 1243.69 1248.02 1271.77 1275.40 1285.11 1293.12 1315.88 1324.30 1333.16 1344.53 1345.19 1370.62 1375.33 1376.84 1382.32 1384.99 1392.77 1393.51 1393.89 1395.20 1397.27 1399.80 1402.60 1411.72 1412.82 1413.18 1414.04 1416.22 1421.18 1423.83 1453.22 1458.35 1469.61 1473.70 1475.42 1489.22 1504.93 1511.13 1559.76 1576.24 1597.39 1608.84 1614.97 1619.70 2974.55 2975.25 2975.80 2976.34 2979.47 2980.31 3047.43 3048.01 3057.37 3060.28 3064.42 3064.58 3091.81 3092.56 3112.12 3112.23 3119.19 3120.43 3140.90 3149.67 3151.87 3156.31
frequency: 18.56 24.75 31.77 33.31 37.10 40.34 46.43 49.32 71.39 74.10 78.70 84.27 85.29 91.58 96.43 102.66 105.68 108.39 111.97 120.70 123.46 131.59 137.77 155.67 162.58 165.34 168.18 173.84 174.53 178.56 184.12 186.19 189.45 196.64 199.63 202.66 209.37 222.18 237.18 242.05 251.85 270.84 276.13 282.38 300.66 320.00 322.78 344.25 352.23 376.93 419.54 432.82 455.33 458.69 499.52 502.28 521.04 533.14 537.19 577.32 602.78 608.70 631.74 649.30 661.48 697.14 702.38 703.87 703.92 712.51 714.90 727.72 732.21 734.87 739.32 760.75 768.13 798.51 798.69 799.97 833.22 864.08 872.39 881.96 889.13 894.33 905.86 958.72 977.65 979.04 993.89 1003.26 1009.91 1012.86 1022.55 1045.16 1047.15 1052.86 1056.16 1057.82 1072.30 1073.21 1114.48 1117.56 1122.79 1131.98 1148.97 1158.32 1181.37 1201.81 1243.29 1243.69 1248.02 1271.77 1275.40 1285.11 1293.12 1315.88 1324.30 1333.16 1344.53 1345.19 1370.62 1375.33 1376.84 1382.32 1384.99 1392.77 1393.51 1393.89 1395.20 1397.27 1399.80 1402.60 1411.72 1412.82 1413.18 1414.04 1416.22 1421.18 1423.83 1453.22 1458.35 1469.61 1473.70 1475.42 1489.22 1504.93 1511.13 1559.76 1576.24 1597.39 1608.84 1614.97 1619.70 2974.55 2975.25 2975.80 2976.34 2979.47 2980.31 3047.43 3048.01 3057.37 3060.28 3064.42 3064.58 3091.81 3092.56 3112.12 3112.23 3119.19 3120.43 3140.90 3149.67 3151.87 3156.31
formula: C20H22N7O11Sm
InChI: InChI=1/C20H22N4O2.3NO3.Sm/c1-11-9-15(19(25)23(3)4)21-17-13(11)7-8-14-12(2)10-16(22-18(14)17)20(26)24(5)6;3*2-1(3)4;/h7-10H,1-6H3;;;;/q-4;3*-2;+10/rC20H22N7O11Sm/c1-11-9-15-19(21(3)4)31-39(33-25(28)34-39,35-26(29)36-39,37-27(30)38-39)23(15)17-13(11)7-8-14-12(2)10-16(24(39)18(14)17)20(32-39)22(5)6/h7-10H,1-6H3
61 atoms
C  -0.436524 -0.47303 -4.088597
C  -0.548959 0.906415 -4.287789
C  -0.386292 -0.94976 -2.739948
C  -0.632377 1.781658 -3.183888
C  -0.453017 0.012617 -1.689263
N  -0.581068 1.337538 -1.922164
C  -0.234213 -2.336007 -2.393233
C  -0.109228 -2.738713 -1.082534
C  -0.127823 -1.790528 -0.003473
C  -0.323821 -0.411252 -0.308585
H  -0.538725 1.30304 -5.309292
H  -0.202883 -3.086079 -3.192817
H  0.019383 -3.803842 -0.855148
C  0.079945 -2.145883 1.366919
N  -0.355524 0.549642 0.638413
C  -0.217851 0.210643 1.924641
C  0.032002 -1.123454 2.318922
H  0.222052 -1.368152 3.369032
C  -0.610693 3.289175 -3.259173
O  -0.001197 3.890209 -2.324954
C  -0.237437 1.416929 2.832445
O  0.086218 2.52602 2.311479
N  -1.192128 3.953318 -4.268089
N  -0.574979 1.328878 4.128858
C  -2.153148 3.380888 -5.209335
H  -1.700753 3.258517 -6.212134
H  -2.536919 2.415863 -4.846163
H  -3.004233 4.08063 -5.291729
C  -1.018177 5.401835 -4.353933
H  -0.092328 5.697383 -3.838075
H  -0.96649 5.684722 -5.419892
H  -1.879773 5.918619 -3.887289
C  -1.248678 0.192827 4.756938
H  -1.741486 -0.440598 4.004156
H  -0.540861 -0.408617 5.359323
H  -2.026783 0.594157 5.430095
C  -0.422586 2.508252 4.979482
H  -1.39241 3.033144 5.084083
H  -0.088189 2.175678 5.978107
H  0.318001 3.193375 4.540867
Sm -0.460052 3.083568 -0.022538
N  2.528282 3.26696 0.032231
O  3.75733 3.342162 0.075518
O  1.780886 4.251763 0.365073
O  1.931146 2.202237 -0.347424
N  -3.403517 2.697579 -0.539546
O  -4.611953 2.565291 -0.748143
O  -2.695961 3.532718 -1.202837
O  -2.79174 2.008903 0.343642
N  -1.644291 5.703277 0.932519
O  -2.161718 6.762229 1.301519
O  -1.924202 4.589111 1.494301
O  -0.804675 5.663025 -0.027855
C  -0.342478 -1.4149 -5.25042
H  0.609815 -1.980368 -5.220612
H  -1.158355 -2.16352 -5.213166
H  -0.403027 -0.872467 -6.208039
C  0.355307 -3.563427 1.768917
H  -0.487214 -4.22283 1.480427
H  1.254149 -3.950753 1.250005
H  0.509757 -3.645473 2.857299
elementType: C N H O Sm
totalener: -2017.44178653 hartree
nucrepener: 5031.80477888 hartree
electener: -7049.24656541 hartree
twoeener: 5742.95759989 hartree
cpcmener: -0.09749542 hartree
kineticenergy: 1973.64291099 hartree
exchangeener: -251.479859627176 hartree
correlationener: -9.896659726011 hartree
xcener: -261.376519353187 hartree
chargesum: -0.0000000
charge: -0.771456 -0.175117 -0.539624 -0.209457 -0.311214 -0.035314 -0.680817 -0.674575 -0.643893 0.006381 -0.106928 0.850437 0.912012 -0.826316 -0.186900 -0.151931 -0.213443 -0.130283 0.839677 -1.119996 0.852241 -1.139216 -1.462414 -1.365370 0.939332 0.104757 -0.018530 -0.157819 1.056435 -0.114661 -0.070655 0.061891 0.877304 0.045214 0.136218 -0.226308 1.021311 0.039437 -0.037101 -0.132423 4.047182 0.540236 -0.424326 -0.620716 -0.647137 0.522428 -0.441553 -0.581247 -0.586612 0.542785 -0.449245 -0.623887 -0.577574 1.067685 0.293474 0.306376 -0.138989 1.063801 0.302660 0.300090 -0.136317
charge: -0.110448 0.130285 -0.041000 -0.018859 -0.001614 -0.052389 0.086352 0.086265 -0.041005 -0.005300 0.031087 0.028675 0.028793 -0.111629 -0.055634 -0.013144 0.130100 0.024174 -0.050478 -0.313775 -0.019877 -0.319758 -0.200925 -0.202898 0.240406 0.024657 0.005530 0.021247 0.247751 0.002593 0.020983 0.028947 0.239228 0.006966 0.025066 0.019971 0.245857 0.028895 0.021952 0.001092 1.725975 -0.377022 -0.043804 -0.179544 -0.178445 -0.369911 -0.047815 -0.172427 -0.177306 -0.380235 -0.055706 -0.172458 -0.171889 0.159845 0.025563 0.024935 0.006756 0.159538 0.025048 0.024325 0.006437
qa: -0.7715 -0.1751 -0.5396 -0.2095 -0.3112 -0.0353 -0.6808 -0.6746 -0.6439 0.0064 -0.1069 0.8504 0.9120 -0.8263 -0.1869 -0.1519 -0.2134 -0.1303 0.8397 -1.1200 0.8522 -1.1392 -1.4624 -1.3654 0.9393 0.1048 -0.0185 -0.1578 1.0564 -0.1147 -0.0707 0.0619 0.8773 0.0452 0.1362 -0.2263 1.0213 0.0394 -0.0371 -0.1324 4.0472 0.5402 -0.4243 -0.6207 -0.6471 0.5224 -0.4416 -0.5812 -0.5866 0.5428 -0.4492 -0.6239 -0.5776 1.0677 0.2935 0.3064 -0.1390 1.0638 0.3027 0.3001 -0.1363
va: 5.7596 3.7270 4.6820 4.5602 5.3641 4.9590 4.7842 4.6810 4.7826 4.9991 1.3939 0.8434 0.7228 5.5758 5.1853 4.4622 3.8808 1.4473 3.2722 1.4427 2.9922 1.4572 5.5769 5.4408 3.7409 0.8343 1.0563 0.9197 3.5718 1.1178 0.9082 0.8485 3.7962 0.9899 0.8237 0.9570 3.5825 0.8611 0.9016 1.1393 -2.7911 4.0621 1.7852 1.5443 1.5582 4.1012 1.7845 1.2019 1.5176 4.0761 1.7651 1.3966 1.4813 3.5453 0.8649 0.8791 1.2527 3.5320 0.8739 0.8736 1.2644
dispersion: -0.090109611 hartree
energy: -2017.531896140566 hartree
dipole: -15.60143 15.61548 0.01405 -153.88886 143.83475 -10.05412 -45.82912 43.34237 -2.48675
magnitude: 10.35709 au
magnitude: 26.32563 debye
temp: 298.15 k
press: 1.00 atm
zeropoint: 0.43053573 hartree
thermalvibcorrection: 0.03775144 hartree
thermalrotcorrection: 0.00141627 hartree
thermaltrasncorrection: 0.00141627 hartree
thermaltotal: -2017.06077643 hartree
thermalcorr: 0.04058399 hartree
nonthermalcorr: 0.43053573 hartree
totalcorr: 0.47111971 hartree
thermalcorrenthalpy: 0.00094421 hartree
totalenthalpy: -2017.05983222 hartree
vibrat: 0.06975552 hartree
rotat: 0.01779338 hartree
transl: 0.02160029 hartree
total: 0.10914919 hartree
totalentropycorr: -0.10914919 hartree
gibbsenthalpy: -2017.16898141 hartree
gibbsminuselec: 0.36291473 hartree
