program: Orca
programVersion: 5.0.4
elementType: C C C C C N C C C C H H H C N C C H C O C O N N C H H H C H H H C H H H C H H H Ho N O O O N O O O N O O O O C H H H O C H H H
elementType: Ho
keywords: def2-SVPD def2/JK def2/J def2-SVPD/C PBE rijcosx rhf hcore XYZFile VeryTightSCF freq cpcm(water) D3 defgrid3
charge: 0
multiplicity: 1
frequency: 0.00 0.00 0.00 0.00 0.00 0.00 15.07 22.10 28.25 29.18 32.65 41.79 50.70 53.98 60.60 71.67 74.43 77.13 88.05 97.30 98.35 102.45 103.75 109.27 117.79 121.77 129.04 131.57 136.88 145.24 147.64 148.31 152.42 157.23 162.76 169.33 175.89 177.07 186.31 187.74 188.80 196.15 199.46 210.81 221.77 224.88 237.16 242.13 253.34 275.47 278.66 280.78 297.37 303.17 308.93 327.60 332.61 363.78 386.92 389.82 421.17 434.47 477.55 490.59 515.09 516.56 541.63 548.01 587.24 593.06 623.41 628.54 648.30 665.17 671.54 700.57 702.63 702.88 709.50 716.45 735.82 737.64 738.20 743.23 752.29 760.08 768.89 797.64 798.16 799.25 823.51 825.34 831.49 869.96 878.24 884.15 908.28 937.08 965.80 977.47 986.20 1045.12 1047.59 1049.94 1056.30 1058.88 1060.80 1072.31 1073.32 1075.71 1116.92 1118.63 1126.34 1127.62 1129.58 1137.73 1138.53 1165.26 1170.86 1181.10 1185.76 1190.83 1240.67 1245.79 1246.76 1284.20 1292.91 1299.40 1303.93 1347.40 1351.36 1354.86 1375.01 1376.84 1379.38 1382.47 1383.63 1392.44 1393.89 1397.27 1399.20 1404.90 1406.78 1412.22 1412.91 1413.52 1414.51 1415.38 1417.42 1426.98 1427.89 1438.95 1442.09 1458.04 1458.76 1470.98 1473.91 1476.86 1491.04 1507.66 1520.10 1564.01 1572.68 1595.56 1610.83 1613.79 1619.94 2970.02 2970.16 2975.26 2976.01 2978.92 2979.82 3058.20 3060.67 3063.26 3063.55 3064.58 3065.00 3111.54 3115.01 3117.60 3117.98 3118.74 3120.13 3143.93 3155.17 3179.15 3187.77
frequency: 15.07 22.10 28.25 29.18 32.65 41.79 50.70 53.98 60.60 71.67 74.43 77.13 88.05 97.30 98.35 102.45 103.75 109.27 117.79 121.77 129.04 131.57 136.88 145.24 147.64 148.31 152.42 157.23 162.76 169.33 175.89 177.07 186.31 187.74 188.80 196.15 199.46 210.81 221.77 224.88 237.16 242.13 253.34 275.47 278.66 280.78 297.37 303.17 308.93 327.60 332.61 363.78 386.92 389.82 421.17 434.47 477.55 490.59 515.09 516.56 541.63 548.01 587.24 593.06 623.41 628.54 648.30 665.17 671.54 700.57 702.63 702.88 709.50 716.45 735.82 737.64 738.20 743.23 752.29 760.08 768.89 797.64 798.16 799.25 823.51 825.34 831.49 869.96 878.24 884.15 908.28 937.08 965.80 977.47 986.20 1045.12 1047.59 1049.94 1056.30 1058.88 1060.80 1072.31 1073.32 1075.71 1116.92 1118.63 1126.34 1127.62 1129.58 1137.73 1138.53 1165.26 1170.86 1181.10 1185.76 1190.83 1240.67 1245.79 1246.76 1284.20 1292.91 1299.40 1303.93 1347.40 1351.36 1354.86 1375.01 1376.84 1379.38 1382.47 1383.63 1392.44 1393.89 1397.27 1399.20 1404.90 1406.78 1412.22 1412.91 1413.52 1414.51 1415.38 1417.42 1426.98 1427.89 1438.95 1442.09 1458.04 1458.76 1470.98 1473.91 1476.86 1491.04 1507.66 1520.10 1564.01 1572.68 1595.56 1610.83 1613.79 1619.94 2970.02 2970.16 2975.26 2976.01 2978.92 2979.82 3058.20 3060.67 3063.26 3063.55 3064.58 3065.00 3111.54 3115.01 3117.60 3117.98 3118.74 3120.13 3143.93 3155.17 3179.15 3187.77
formula: C20H22HoN7O13
InChI: InChI=1/C20H22N4O4.Ho.3NO3/c1-23(2)19(25)13-9-15(27-5)11-7-8-12-16(28-6)10-14(20(26)24(3)4)22-18(12)17(11)21-13;;3*2-1(3)4/h7-10H,1-6H3;;;;/q-4;+10;3*-2/rC20H22HoN7O13/c1-22(2)19-13-9-15(32-5)11-7-8-12-16(33-6)10-14-20(23(3)4)35-21(34-19,36-26(29)37-21,38-27(30)39-21,40-28(31)41-21)24(13)17(11)18(12)25(14)21/h7-10H,1-6H3
63 atoms
C  -0.417258 -0.430788 -4.059705
C  -0.507541 0.95392 -4.274964
C  -0.404146 -0.931197 -2.714929
C  -0.619812 1.809782 -3.16171
C  -0.497607 0.031462 -1.674543
N  -0.619273 1.360326 -1.900241
C  -0.253722 -2.317506 -2.38634
C  -0.153691 -2.725424 -1.072309
C  -0.196075 -1.771947 -0.004481
C  -0.38854 -0.395219 -0.297561
H  -0.45436 1.366465 -5.285603
H  -0.2023 -3.050222 -3.200512
H  -0.022801 -3.786592 -0.829179
C  -0.005955 -2.112278 1.37598
N  -0.423888 0.569517 0.647207
C  -0.282659 0.231056 1.933093
C  -0.045345 -1.097577 2.344949
H  0.14061 -1.331744 3.39508
C  -0.575866 3.318764 -3.213979
O  -0.030439 3.895009 -2.226738
C  -0.287894 1.452136 2.822816
O  0.006197 2.551628 2.26616
N  -1.067206 4.00917 -4.253021
N  -0.577463 1.391302 4.132302
C  -1.968598 3.471506 -5.270882
H  -1.44429 3.337412 -6.236742
H  -2.409329 2.518612 -4.942651
H  -2.787175 4.199052 -5.414927
C  -0.858628 5.454904 -4.301209
H  0.03807 5.722674 -3.722242
H  -0.731878 5.753845 -5.356326
H  -1.737619 5.982994 -3.882049
C  -1.213031 0.263755 4.81294
H  -1.746301 -0.38077 4.098032
H  -0.472766 -0.328975 5.38461
H  -1.952763 0.673847 5.522716
C  -0.403507 2.59196 4.948756
H  -1.372668 3.112903 5.076229
H  -0.029967 2.285704 5.941888
H  0.315357 3.270928 4.46681
Ho -0.551344 3.01964 -0.026769
N  2.368141 3.274425 0.056868
O  3.59501 3.381589 0.10666
O  1.59095 4.233728 0.390486
O  1.798541 2.198326 -0.331449
N  -3.421597 2.634171 -0.633859
O  -4.619874 2.500353 -0.896318
O  -2.695601 3.502248 -1.231659
O  -2.834803 1.916734 0.240988
N  -1.798823 5.524924 0.981066
O  -2.346342 6.560473 1.37402
O  -2.079422 4.383773 1.482059
O  -0.923965 5.534137 0.052699
O  0.216886 -3.403284 1.641595
C  0.424301 -3.811861 3.004847
H  1.324521 -3.320092 3.420762
H  -0.462938 -3.565937 3.61954
H  0.571253 -4.901555 2.968819
O  -0.307938 -1.341477 -5.030455
C  -0.291869 -0.905961 -6.401632
H  -1.228766 -0.369438 -6.645163
H  0.581716 -0.251563 -6.585624
H  -0.211386 -1.823422 -7.003267
elementType: C N H O Ho
totalener: -2170.56673859 hartree
nucrepener: 5506.31981064 hartree
electener: -7676.88654923 hartree
twoeener: 6274.84139480 hartree
cpcmener: -0.10263840 hartree
kineticenergy: 2124.13996159 hartree
exchangeener: -268.240078858878 hartree
correlationener: -10.471097450329 hartree
xcener: -278.711176309207 hartree
chargesum: -0.0000000
charge: 0.725876 -0.073060 -0.556197 -0.385373 -0.405946 0.070805 -0.342918 -0.346997 -0.635172 -0.085303 -0.030053 0.682634 0.752934 0.678148 -0.196616 -0.318354 -0.067563 -0.105093 0.888407 -0.950209 0.938304 -1.058618 -1.445822 -1.365666 0.904785 0.162835 0.008789 -0.231244 1.058114 -0.111222 -0.083756 0.060052 0.832106 0.078197 0.194902 -0.279794 1.026979 0.039325 -0.030452 -0.139141 3.069999 0.553693 -0.441079 -0.581808 -0.576526 0.533234 -0.453669 -0.511214 -0.530795 0.549195 -0.457030 -0.544530 -0.511882 -0.750021 0.862346 0.314674 0.273992 -0.676628 -0.769650 0.876200 0.272874 0.308592 -0.668590
charge: 0.012898 0.156006 -0.018323 -0.012882 0.000069 -0.056132 0.091900 0.091677 -0.017972 -0.004100 0.018455 0.030755 0.030768 0.011556 -0.062523 -0.006577 0.156220 0.009923 -0.040054 -0.298035 -0.009715 -0.303588 -0.199241 -0.201116 0.241132 0.025847 0.006232 0.020889 0.247934 0.003577 0.020846 0.029453 0.240087 0.007897 0.026590 0.019611 0.246486 0.029071 0.021962 0.001723 1.532912 -0.369882 -0.042677 -0.168677 -0.165572 -0.364187 -0.047233 -0.161490 -0.163640 -0.373188 -0.054859 -0.158568 -0.161766 -0.312569 0.279117 0.035706 0.035230 0.025653 -0.311097 0.280398 0.035360 0.035801 0.025923
qa: 0.7259 -0.0731 -0.5562 -0.3854 -0.4059 0.0708 -0.3429 -0.3470 -0.6352 -0.0853 -0.0301 0.6826 0.7529 0.6781 -0.1966 -0.3184 -0.0676 -0.1051 0.8884 -0.9502 0.9383 -1.0586 -1.4458 -1.3657 0.9048 0.1628 0.0088 -0.2312 1.0581 -0.1112 -0.0838 0.0601 0.8321 0.0782 0.1949 -0.2798 1.0270 0.0393 -0.0305 -0.1391 3.0700 0.5537 -0.4411 -0.5818 -0.5765 0.5332 -0.4537 -0.5112 -0.5308 0.5492 -0.4570 -0.5445 -0.5119 -0.7500 0.8623 0.3147 0.2740 -0.6766 -0.7696 0.8762 0.2729 0.3086 -0.6686
va: 3.4957 3.8608 5.0098 4.3939 5.4437 5.2777 4.8744 4.7908 5.1635 5.1236 1.5606 1.1195 0.9968 3.4023 5.4523 4.3232 3.8644 1.7016 3.1380 1.5862 2.8523 1.7289 5.5559 5.4298 3.7769 0.7818 1.0004 0.9224 3.5868 1.1087 0.9042 0.8348 3.8392 0.9300 0.7744 0.9621 3.5861 0.8605 0.8964 1.1367 -0.4814 4.0604 1.7805 1.4258 1.5026 4.1173 1.7766 1.1892 1.5087 4.0805 1.7619 1.3065 1.4251 2.8096 3.8246 0.6512 0.6907 0.8339 2.8345 3.8181 0.6932 0.6552 0.8311
dispersion: -0.091988193 hartree
energy: -2170.658726780457 hartree
dipole: -5.82014 6.39628 0.57614 -176.77903 167.31336 -9.46567 -54.11072 51.69641 -2.41431
magnitude: 9.78570 au
magnitude: 24.87326 debye
temp: 298.15 k
press: 1.00 atm
zeropoint: 0.44053641 hartree
thermalvibcorrection: 0.03964987 hartree
thermalrotcorrection: 0.00141627 hartree
thermaltrasncorrection: 0.00141627 hartree
thermaltotal: -2170.17570795 hartree
thermalcorr: 0.04248242 hartree
nonthermalcorr: 0.44053641 hartree
totalcorr: 0.48301883 hartree
thermalcorrenthalpy: 0.00094421 hartree
totalenthalpy: -2170.17476374 hartree
vibrat: 0.07346738 hartree
rotat: 0.01796435 hartree
transl: 0.02169312 hartree
total: 0.11312485 hartree
totalentropycorr: -0.11312485 hartree
gibbsenthalpy: -2170.28788860 hartree
gibbsminuselec: 0.37083819 hartree
