program: Gaussian 09
title: 000063282
version: EM64L-G09RevD.01
frameworkgroup: C1[X(C18H13BrN4O2S)]
method: RPBEPBE
basis: SDD
operation: Freq
keyword: #p
keyword: freq=noraman
keyword: PBEPBE/SDD
title: #p freq=noraman PBEPBE/SDD
converged: YES YES NO NO
title: Mulliken charges:
elementType: Br S O O N N N N C C C C C C C C C C C C C C C C C C H H H H H H H H H H H H H
charge: 0.026522 0.230477 -0.195446 -0.237863 -0.122008 -0.144973 -0.024122 -0.034646 -0.398237 0.327403 -0.207127 0.207459 -0.773887 0.135601 0.057297 -0.218343 -0.257990 -0.322604 -0.241099 -0.154996 0.303414 -0.337308 -0.384072 -0.214059 -0.199866 -0.247649 0.295960 0.250235 0.300030 0.311335 0.263142 0.290049 0.269610 0.257901 0.252081 0.245440 0.229792 0.230569 0.231976
chargesum: 0.00000
title: Mulliken charges with hydrogens summed into heavy atoms:
elementType: Br S O O N N N N C C C C C C C C C C C C C C C C C C
charge: 0.026522 0.230477 -0.195446 -0.237863 -0.122008 -0.144973 -0.024122 -0.034646 0.147958 0.327403 -0.207127 0.207459 -0.162523 0.135601 0.057297 0.044800 0.032059 -0.052994 -0.241099 0.102905 0.303414 -0.085227 -0.138632 0.015734 0.030703 -0.015673
polarizability: 3.12593344e+02 2.90484472e+01 3.13385831e+02 -2.95414281e+01 -1.65610041e+01 1.97720775e+02
1716.lowfreq: -2.2969 -0.0007 0.0012 0.0015 1.8656 3.1618 11.8916 24.2264 31.5232
frequency: 11.8385 24.1689 31.5203 33.8515 56.1202 70.3070 80.2889 97.9368 109.5519 120.1592 139.5319 155.2818 180.2050 220.1742 237.4792 256.7370 280.7524 289.6278 308.6889 324.4096 356.1403 370.3398 407.4905 428.0120 440.8383 466.0479 488.6774 504.1256 509.7210 538.4818 546.9027 565.0652 571.3918 588.2529 590.0087 597.0902 601.4452 624.6616 645.6439 695.3181 695.6703 706.5353 728.9272 768.3730 773.0088 790.1794 807.1596 839.6577 842.7921 843.1086 880.8943 885.9631 899.1837 914.5871 928.7731 956.5351 971.3835 979.0129 982.8517 987.7215 991.6866 1022.5270 1054.7438 1056.7968 1080.9953 1105.8937 1126.6462 1142.7486 1159.3854 1171.3015 1181.4231 1193.2956 1218.3044 1230.6640 1236.4173 1253.3763 1287.3398 1296.4233 1312.5660 1366.6773 1375.2179 1376.8154 1388.0542 1402.3459 1409.1238 1427.6638 1439.0931 1448.4445 1451.5913 1477.6607 1542.5899 1561.9701 1580.7322 1601.7753 1603.6440 1612.7980 1637.6697 1683.9142 3037.3672 3051.3583 3105.2580 3126.1011 3128.6047 3135.6157 3147.9340 3157.4041 3162.0880 3166.3436 3170.5314 3171.0037 3181.7644
redmass: 9.1274 4.4434 6.4035 8.1451 9.5868 9.3822 6.7979 7.1979 3.9329 4.9545 8.8762 6.7409 7.7956 6.0976 9.9301 8.1679 6.6691 5.7421 6.7473 6.6305 3.0110 5.5513 2.9078 3.2532 7.4746 11.5094 4.8829 4.1039 6.9461 4.5970 5.2164 7.2362 5.5973 3.3635 6.8197 7.9250 6.9652 6.9665 5.5383 1.9211 6.4345 6.4228 5.7325 1.7953 5.5951 4.1719 5.9324 1.2746 4.8455 1.6268 4.0453 1.5319 1.6355 1.4452 1.4498 5.0547 1.3782 1.3557 4.3449 4.6628 1.3309 2.1542 3.2229 2.5111 1.5483 2.3657 1.1524 3.4422 2.7624 1.0723 1.2392 2.5196 3.3619 1.6386 1.8829 1.3880 3.7615 5.2097 1.4275 1.8206 6.3832 2.3333 1.9928 2.2302 1.7766 1.0866 2.3624 1.5206 1.7950 2.2944 7.9283 7.4076 6.1038 7.8095 6.5976 9.9419 11.8809 11.3637 1.0579 1.0572 1.1071 1.1067 1.0849 1.0879 1.0929 1.0963 1.0888 1.0933 1.1015 1.0929 1.0979
irintensity: 0.0900 0.1433 0.3097 0.7207 2.6028 0.1357 0.2461 1.5239 6.5807 1.6379 2.7730 1.0757 0.2591 1.8181 0.7966 3.0250 8.9482 0.5241 1.8096 2.1460 23.6357 3.1681 0.4021 13.1860 25.9280 11.8521 7.4443 11.1591 1.3694 16.0608 2.3324 4.1368 8.4779 2.7477 43.0529 5.4943 2.5876 3.0401 14.1208 39.3113 5.1639 0.9654 17.3749 73.1698 3.4528 2.9086 18.4896 0.1699 36.8554 39.2305 45.3292 33.8133 6.5670 9.5426 8.1268 20.6094 0.4088 1.4847 24.5563 12.6955 0.1322 8.6054 7.2200 14.6451 14.0691 26.9490 0.6692 94.4333 59.3229 0.2666 0.8017 26.0796 116.6659 69.4119 40.2579 12.0285 166.4753 255.2951 15.7960 19.7752 1.6468 21.1984 24.5582 7.0056 9.7180 11.7327 4.7884 89.5993 78.1953 18.5220 10.5556 152.4215 17.5397 36.4219 160.7098 161.1338 846.0031 84.2037 11.4432 5.0061 5.9775 0.4833 4.3843 3.0520 18.6427 24.9526 0.8810 3.5703 19.7620 2.2650 4.7971
temp: 298.150 k
press: 1.00000 atm
elementType: 35 16 8 8 7 7 7 7 6 6 6 6 6 6 6 6 6 6 6 6 6 6 6 6 6 6 1 1 1 1 1 1 1 1 1 1 1 1 1
symmnumber: 1
zpe: 729711.8 jmol-1
zpe.correction: 0.277933 hartree
zpe.thermalcorrener: 0.300028 hartree
zpe.thermalcorrenthalpy: 0.300973 hartree
zpe.thermalcorrgfe: 0.222650 hartree
zpe.sumelectzpe: -1472.915424 hartree
zpe.sumelectthermal: -1472.893328 hartree
zpe.sumelectthermalent: -1472.892384 hartree
zpe.sumelectthermalfe: -1472.970707 hartree
dipole: -3.0165 -2.2732 0.0574
dipole: 3.7776
quadrupole: -161.5883 -170.3796 -156.6391
quadrupole: -4.5033 0.1450 -3.1434
quadrupole: 1.2807 -7.5106 6.2299 -4.5033 0.1450 -3.1434
hfenergy: -1473.1933568 hartree
pointgroup: C01 [X(C18H13Br1N4O2S1)]
dipole: 1.3203536 0.6642069 0.1559464 debye
polarizability: 315.9885976|25.42416|302.591654|43.3631255|15.2026694|205.1196988 unknown
InChI: InChI=1S/C18H13BrN4O2S/c19-12-6-7-15-14(8-12)17(25)22(10-20-15)11-23-16(24)9-26-18(23)21-13-4-2-1-3-5-13/h1-8,10H,9,11H2
charge 0 multiplicity 1
39 atoms
Br -6.228076 1.363848 -1.936098
S  2.662174 -2.197102 -1.710712
O  0.024607 -4.414565 0.31322
O  -2.084341 -1.991138 -0.147575
N  0.932486 -2.24163 0.357341
N  -0.727474 -0.646426 1.212212
N  -1.149932 1.699792 1.591955
N  2.274921 -0.307667 0.41277
C  0.132101 -1.81042 1.512617
C  0.756421 -3.53242 -0.190328
C  1.940408 -1.406408 -0.174339
C  -1.859473 -0.854035 0.358298
C  1.583828 -3.72634 -1.457401
C  -2.680655 0.356885 0.160158
C  -2.300862 1.589773 0.784154
C  -0.43019 0.610033 1.760541
C  -3.844532 0.284154 -0.648409
C  -3.106476 2.743187 0.579871
C  -4.615221 1.439511 -0.825459
C  -4.258751 2.674117 -0.218938
C  3.214658 0.652956 -0.040879
C  3.350573 1.025888 -1.407814
C  4.003158 1.30982 0.941831
C  4.279495 2.021927 -1.77706
C  4.936976 2.294737 0.561392
C  5.082009 2.655064 -0.799794
H  -0.496935 -2.67738 1.779922
H  0.79962 -1.528157 2.342457
H  2.219178 -4.619171 -1.358718
H  0.909175 -3.844444 -2.31995
H  0.485047 0.655889 2.35718
H  -4.106253 -0.672856 -1.108787
H  -2.804026 3.678375 1.059281
H  -4.878509 3.561525 -0.375255
H  2.713126 0.563652 -2.169781
H  3.874566 1.029383 1.992251
H  4.371299 2.307777 -2.830766
H  5.54662 2.787048 1.327008
H  5.802157 3.426417 -1.092794
