program: Orca
programVersion: 4.2.1
elementType: Cl Cl O O O N N N C C C C C C C C C C C C C C C C C C C H H H H H H H H H H H H H H H H H
charge: 0
multiplicity: 1
keywords: wb97x-d3
keywords: def2-TZVPP
keywords: def2/J RIJCOSX GRIDX6 NOFINALGRIDX
keywords: grid4 nofinalgrid
keywords: scfconv7
keywords: smallprint printgap noloewdin
keywords: NOSOSCF
formula: C19H17Cl2N3O3
InChI: InChI=1/C19H17Cl2N3O3/c1-13-9-25-19(27-13,10-24-12-22-11-23-24)17-7-6-16(8-18(17)21)26-15-4-2-14(20)3-5-15/h2-8,11-13H,9-10H2,1H3
44 atoms
Cl 1.745884 -0.598238 -2.722646
Cl -7.735792 1.139587 1.323073
O  3.419339 0.012913 -0.356496
O  2.511584 -0.098528 1.697288
O  -2.644806 1.434526 -1.551215
N  3.675585 -2.538772 0.715405
N  3.932503 -2.848123 1.990354
N  5.793424 -3.027246 0.749614
C  2.346301 -0.503576 0.366854
C  3.996635 1.072687 0.387785
C  2.395592 -2.038938 0.299028
C  3.71045 0.634587 1.815727
C  1.00864 0.006854 -0.155741
C  5.459374 1.209591 0.042139
C  0.667443 0.002004 -1.507738
C  0.052584 0.491687 0.731724
C  -0.560877 0.462286 -1.952376
C  -1.179958 0.961988 0.313881
C  -1.484083 0.948035 -1.039925
C  4.799799 -2.642818 -0.009068
C  5.209922 -3.138149 1.962998
C  -3.802899 1.340108 -0.835015
C  -4.619837 2.458749 -0.783163
C  -4.197544 0.155609 -0.226259
C  -5.836982 2.396366 -0.12411
C  -5.408938 0.096794 0.441802
C  -6.22448 1.217094 0.491225
H  3.468955 2.010717 0.165913
H  2.195736 -2.382229 -0.715245
H  1.633168 -2.456148 0.954785
H  4.513383 0.004638 2.215985
H  3.555759 1.473936 2.495888
H  6.001474 0.285639 0.247394
H  5.593576 1.4626 -1.008753
H  5.909763 2.007943 0.632955
H  0.283723 0.512677 1.786801
H  -0.80095 0.451185 -3.006642
H  -1.885011 1.342985 1.040504
H  4.839679 -2.433907 -1.066583
H  5.740622 -3.450426 2.84883
H  -4.306193 3.375253 -1.264909
H  -3.569073 -0.724405 -0.2735
H  -6.477347 3.266563 -0.085209
H  -5.720249 -0.823707 0.915847
totalener: -2044.67068937 hartree
nucrepener: 2695.61677304 hartree
electener: -4740.28746241 hartree
oneelecener: -8161.28256002 hartree
twoeener: 3420.99509760 hartree
kineticenergy: 2038.71460235 hartree
xcener: -149.989617881601 hartree
chargesum: 0.0000000
charge: -0.067275 -0.077096 -0.355314 -0.356957 -0.298101 0.126395 -0.308980 -0.332821 0.552034 0.145958 -0.136107 0.002800 -0.124329 -0.265035 0.029893 -0.110453 -0.218201 -0.171995 0.228484 0.017940 0.049392 0.250412 -0.217335 -0.176434 -0.085954 -0.107953 0.057320 0.070906 0.135473 0.119233 0.073709 0.088145 0.087631 0.096188 0.086664 0.139221 0.120846 0.136388 0.145393 0.131201 0.131218 0.137201 0.124069 0.126228
qa: -0.0673 -0.0771 -0.3553 -0.3570 -0.2981 0.1264 -0.3090 -0.3328 0.5520 0.1460 -0.1361 0.0028 -0.1243 -0.2650 0.0299 -0.1105 -0.2182 -0.1720 0.2285 0.0179 0.0494 0.2504 -0.2173 -0.1764 -0.0860 -0.1080 0.0573 0.0709 0.1355 0.1192 0.0737 0.0881 0.0876 0.0962 0.0867 0.1392 0.1208 0.1364 0.1454 0.1312 0.1312 0.1372 0.1241 0.1262
va: 1.2529 1.2274 2.0053 2.0136 2.1106 3.3341 2.8567 3.0315 3.8580 3.8803 3.8139 4.0031 3.6702 3.9650 3.9846 3.9589 4.1222 3.9579 3.8728 4.0774 4.0401 3.8096 4.0516 3.9711 3.9638 3.9825 3.9445 1.0028 1.0182 1.0271 0.9972 1.0013 1.0113 1.0054 1.0059 1.0309 1.0290 1.0056 1.0099 1.0019 1.0119 1.0014 1.0092 1.0100
dispcorr: -0.024592776 hartree
energy: -2044.695282147911
dipole: 27.67799 -28.15532 -0.47733 3.30499 -2.18238 1.12260 7.28403 -7.44381 -0.15978
magnitude: 1.23029 au
magnitude: 3.12715 debye
