program: Orca
programVersion: 5.0.4
elementType: C C C C C N C C C C H H H C N C C H C O C O N N C H H H C H H H C H H H C H H H Pr N O O O N O O O N O O O O C H H H O C H H H
elementType: Pr
keywords: def2-SVPD def2/JK def2/J def2-SVPD/C PBE rijcosx rhf hcore XYZFile VeryTightSCF freq cpcm(water) D3 defgrid3
charge: 0
multiplicity: 1
frequency: 0.00 0.00 0.00 0.00 0.00 0.00 14.96 20.90 27.48 28.13 33.89 36.62 42.52 45.38 58.64 68.79 72.33 76.22 80.37 83.91 87.39 95.76 97.04 103.71 104.34 106.65 115.51 119.36 126.79 128.95 145.08 145.33 149.26 153.53 164.69 165.82 170.30 178.32 181.39 187.45 190.55 197.99 203.39 207.71 215.90 222.47 233.12 240.20 253.68 274.38 277.45 280.94 298.38 299.98 304.75 329.05 331.41 361.52 384.51 385.93 419.08 431.75 472.36 486.48 512.51 515.67 544.21 550.65 585.31 591.25 625.02 631.27 648.29 663.01 672.98 703.04 704.27 704.56 707.70 717.91 729.65 731.98 736.24 737.38 751.68 762.16 768.35 798.85 799.31 800.33 824.61 832.29 838.56 877.30 883.50 887.88 906.22 936.36 965.49 984.09 984.83 1045.65 1047.52 1049.65 1051.85 1055.08 1056.52 1072.58 1073.43 1074.35 1116.63 1118.55 1127.41 1127.70 1128.11 1135.40 1139.16 1163.87 1170.28 1181.26 1184.93 1189.55 1238.47 1244.58 1246.17 1272.48 1283.13 1288.82 1297.30 1343.51 1350.43 1354.25 1375.33 1376.48 1379.04 1381.89 1383.41 1392.05 1392.89 1396.48 1397.46 1404.66 1406.04 1412.26 1413.55 1413.80 1414.04 1415.07 1416.67 1424.41 1424.96 1436.44 1440.91 1455.13 1455.65 1465.19 1471.26 1477.08 1487.48 1507.78 1518.72 1560.79 1571.93 1593.66 1606.58 1611.48 1617.00 2969.72 2970.29 2975.41 2976.01 2979.04 2979.83 3057.08 3059.64 3063.00 3063.43 3064.35 3064.38 3111.65 3113.46 3117.77 3118.47 3119.18 3119.39 3144.90 3155.93 3178.23 3182.53
frequency: 14.96 20.90 27.48 28.13 33.89 36.62 42.52 45.38 58.64 68.79 72.33 76.22 80.37 83.91 87.39 95.76 97.04 103.71 104.34 106.65 115.51 119.36 126.79 128.95 145.08 145.33 149.26 153.53 164.69 165.82 170.30 178.32 181.39 187.45 190.55 197.99 203.39 207.71 215.90 222.47 233.12 240.20 253.68 274.38 277.45 280.94 298.38 299.98 304.75 329.05 331.41 361.52 384.51 385.93 419.08 431.75 472.36 486.48 512.51 515.67 544.21 550.65 585.31 591.25 625.02 631.27 648.29 663.01 672.98 703.04 704.27 704.56 707.70 717.91 729.65 731.98 736.24 737.38 751.68 762.16 768.35 798.85 799.31 800.33 824.61 832.29 838.56 877.30 883.50 887.88 906.22 936.36 965.49 984.09 984.83 1045.65 1047.52 1049.65 1051.85 1055.08 1056.52 1072.58 1073.43 1074.35 1116.63 1118.55 1127.41 1127.70 1128.11 1135.40 1139.16 1163.87 1170.28 1181.26 1184.93 1189.55 1238.47 1244.58 1246.17 1272.48 1283.13 1288.82 1297.30 1343.51 1350.43 1354.25 1375.33 1376.48 1379.04 1381.89 1383.41 1392.05 1392.89 1396.48 1397.46 1404.66 1406.04 1412.26 1413.55 1413.80 1414.04 1415.07 1416.67 1424.41 1424.96 1436.44 1440.91 1455.13 1455.65 1465.19 1471.26 1477.08 1487.48 1507.78 1518.72 1560.79 1571.93 1593.66 1606.58 1611.48 1617.00 2969.72 2970.29 2975.41 2976.01 2979.04 2979.83 3057.08 3059.64 3063.00 3063.43 3064.35 3064.38 3111.65 3113.46 3117.77 3118.47 3119.18 3119.39 3144.90 3155.93 3178.23 3182.53
formula: C20H22N7O13Pr
InChI: InChI=1/C20H22N4O4.3NO3.Pr/c1-23(2)19(25)13-9-15(27-5)11-7-8-12-16(28-6)10-14(20(26)24(3)4)22-18(12)17(11)21-13;3*2-1(3)4;/h7-10H,1-6H3;;;;/q-4;3*-2;+10/rC20H22N7O13Pr/c1-21(2)19-13-9-15(31-5)11-7-8-12-16(32-6)10-14-20(22(3)4)34-41(33-19,35-25(28)36-41,37-26(29)38-41,39-27(30)40-41)23(13)17(11)18(12)24(14)41/h7-10H,1-6H3
63 atoms
C  -0.466565 -0.451755 -4.06824
C  -0.56593 0.929074 -4.296479
C  -0.411404 -0.936988 -2.718703
C  -0.636405 1.795108 -3.188104
C  -0.469368 0.034734 -1.681631
N  -0.586736 1.363354 -1.921221
C  -0.268116 -2.323428 -2.391342
C  -0.153059 -2.729262 -1.078951
C  -0.175991 -1.773339 -0.013712
C  -0.350903 -0.391286 -0.301713
H  -0.556264 1.333097 -5.312349
H  -0.239766 -3.057656 -3.205154
H  -0.031601 -3.7910 -0.83385
C  0.007509 -2.12804 1.364143
N  -0.380181 0.566511 0.654141
C  -0.255922 0.209709 1.93789
C  -0.031098 -1.122996 2.341356
H  0.140652 -1.363757 3.392909
C  -0.615363 3.303479 -3.282421
O  0.015232 3.917395 -2.371591
C  -0.273217 1.403135 2.865512
O  0.0922 2.512778 2.375519
N  -1.222553 3.954163 -4.285558
N  -0.653435 1.300767 4.149558
C  -2.204598 3.370793 -5.198365
H  -1.773023 3.229877 -6.208075
H  -2.584428 2.412709 -4.813285
H  -3.053797 4.07321 -5.275652
C  -1.052213 5.401814 -4.392696
H  -0.114003 5.703943 -3.903686
H  -1.027563 5.672396 -5.462804
H  -1.902268 5.923557 -3.910645
C  -1.378331 0.174575 4.737796
H  -1.858094 -0.437662 3.959707
H  -0.708633 -0.452368 5.357718
H  -2.169766 0.587737 5.387909
C  -0.497641 2.462045 5.024142
H  -1.452514 3.018786 5.097163
H  -0.216541 2.103814 6.03019
H  0.283613 3.127782 4.627956
Pr -0.423608 3.142033 -0.000638
N  2.620362 3.268706 0.058045
O  3.851064 3.318615 0.105127
O  1.894781 4.269291 0.393767
O  2.004575 2.217183 -0.327762
N  -3.422487 2.806108 -0.519845
O  -4.633354 2.691281 -0.729896
O  -2.700852 3.617222 -1.197315
O  -2.827679 2.121224 0.377531
N  -1.566002 5.837089 0.945962
O  -2.060367 6.909794 1.307357
O  -1.868722 4.734691 1.519557
O  -0.730574 5.773707 -0.017294
O  0.216096 -3.423475 1.618732
C  0.404994 -3.847304 2.979883
H  1.306878 -3.370697 3.409592
H  -0.485316 -3.596505 3.588156
H  0.539066 -4.938334 2.934912
O  -0.39525 -1.374396 -5.031359
C  -0.446056 -0.956275 -6.406878
H  -1.395607 -0.425692 -6.61172
H  0.415083 -0.301691 -6.64153
H  -0.391461 -1.881052 -7.000179
elementType: C N H O Pr
totalener: -2165.78156635 hartree
nucrepener: 5426.01953157 hartree
electener: -7591.80109791 hartree
twoeener: 6191.04115507 hartree
cpcmener: -0.10203626 hartree
kineticenergy: 2121.65559653 hartree
exchangeener: -267.716798060236 hartree
correlationener: -10.453006819633 hartree
xcener: -278.169804879869 hartree
chargesum: -0.0000000
charge: 0.733852 0.031177 -0.505893 -0.463454 -0.425024 -0.002158 -0.339815 -0.326774 -0.585802 -0.195735 -0.026746 0.697982 0.771395 0.680109 -0.251453 -0.380331 0.005938 -0.066047 0.779894 -1.043767 0.851562 -1.109996 -1.468616 -1.373904 0.915500 0.142099 0.006726 -0.209362 1.060489 -0.114956 -0.067636 0.058127 0.851449 0.056938 0.173252 -0.260326 1.024771 0.045606 -0.039656 -0.131834 3.809760 0.505992 -0.427986 -0.606378 -0.635382 0.492842 -0.445655 -0.565385 -0.572684 0.510590 -0.449596 -0.600500 -0.555580 -0.752129 0.876107 0.300289 0.267120 -0.671373 -0.761592 0.886633 0.265295 0.299803 -0.667772
charge: 0.011413 0.152460 -0.020754 -0.024638 -0.005441 -0.066343 0.090668 0.090549 -0.020510 -0.008311 0.021938 0.030566 0.030585 0.010382 -0.067766 -0.019386 0.151796 0.014258 -0.055138 -0.321471 -0.025482 -0.327393 -0.201408 -0.203342 0.240204 0.025140 0.006312 0.020622 0.246858 0.001968 0.020796 0.028542 0.239411 0.007297 0.025830 0.019848 0.244743 0.028833 0.021499 0.000909 1.872225 -0.384330 -0.047836 -0.189169 -0.188034 -0.376359 -0.052893 -0.182432 -0.186764 -0.386334 -0.058568 -0.182949 -0.181067 -0.312890 0.279521 0.035692 0.035058 0.025737 -0.311881 0.280431 0.035286 0.035560 0.025950
qa: 0.7339 0.0312 -0.5059 -0.4635 -0.4250 -0.0022 -0.3398 -0.3268 -0.5858 -0.1957 -0.0267 0.6980 0.7714 0.6801 -0.2515 -0.3803 0.0059 -0.0660 0.7799 -1.0438 0.8516 -1.1100 -1.4686 -1.3739 0.9155 0.1421 0.0067 -0.2094 1.0605 -0.1150 -0.0676 0.0581 0.8514 0.0569 0.1733 -0.2603 1.0248 0.0456 -0.0397 -0.1318 3.8098 0.5060 -0.4280 -0.6064 -0.6354 0.4928 -0.4457 -0.5654 -0.5727 0.5106 -0.4496 -0.6005 -0.5556 -0.7521 0.8761 0.3003 0.2671 -0.6714 -0.7616 0.8866 0.2653 0.2998 -0.6678
va: 3.5633 3.9878 4.9725 4.5732 5.5335 5.4965 4.9315 4.8372 5.1127 5.2160 1.4782 1.0855 0.9615 3.5453 5.5856 4.5074 4.1436 1.5520 3.4010 1.5911 3.0661 1.6721 5.5899 5.4749 3.7701 0.8039 1.0068 0.9134 3.5638 1.1153 0.9083 0.8539 3.8288 0.9548 0.7920 0.9414 3.5809 0.8560 0.9031 1.1385 -1.8713 4.1121 1.7716 1.4734 1.4761 4.1517 1.7654 1.1979 1.4846 4.1331 1.7541 1.3525 1.4374 2.8218 3.8222 0.6666 0.6976 0.8294 2.8165 3.8147 0.6996 0.6620 0.8248
dispersion: -0.091362015 hartree
energy: -2165.872928360393 hartree
dipole: -18.07145 17.82557 -0.24588 -165.42751 155.44972 -9.97779 -49.63349 47.20086 -2.43263
magnitude: 10.27300 au
magnitude: 26.11189 debye
temp: 298.15 k
press: 1.00 atm
zeropoint: 0.43978742 hartree
thermalvibcorrection: 0.04004736 hartree
thermalrotcorrection: 0.00141627 hartree
thermaltrasncorrection: 0.00141627 hartree
thermaltotal: -2165.39026103 hartree
thermalcorr: 0.04287990 hartree
nonthermalcorr: 0.43978742 hartree
totalcorr: 0.48266733 hartree
thermalcorrenthalpy: 0.00094421 hartree
totalenthalpy: -2165.38931682 hartree
vibrat: 0.07453808 hartree
rotat: 0.01800816 hartree
transl: 0.02164595 hartree
total: 0.11419219 hartree
totalentropycorr: -0.11419219 hartree
gibbsenthalpy: -2165.50350902 hartree
gibbsminuselec: 0.36941934 hartree
