program: Orca
programVersion: 4.2.1
elementType: Cl Cl O O O N N N C C C C C C C C C C C C C C C C C C C H H H H H H H H H H H H H H H H H
charge: 0
multiplicity: 1
keywords: wb97x-d3
keywords: def2-TZVPP
keywords: def2/J RIJCOSX GRIDX6 NOFINALGRIDX
keywords: grid4 nofinalgrid
keywords: scfconv7
keywords: smallprint printgap noloewdin
keywords: NOSOSCF
formula: C19H17Cl2N3O3
InChI: InChI=1/C19H17Cl2N3O3/c1-13-9-25-19(27-13,10-24-12-22-11-23-24)17-7-6-16(8-18(17)21)26-15-4-2-14(20)3-5-15/h2-8,11-13H,9-10H2,1H3
44 atoms
Cl 0.306844 -1.547095 -1.265547
Cl -7.664891 -0.093137 -0.758448
O  3.059944 -0.575409 -0.769193
O  3.452109 0.784398 0.977597
O  -2.46818 2.510283 -0.06383
N  3.677443 -2.027897 1.522092
N  4.57089 -1.70787 2.463416
N  5.415643 -3.253843 1.074138
C  2.539903 -0.135683 0.446581
C  4.043445 0.349226 -1.202764
C  2.424863 -1.337001 1.400246
C  4.568587 0.881416 0.121746
C  1.182521 0.536619 0.278603
C  5.069538 -0.353068 -2.058161
C  0.140014 -0.023561 -0.457277
C  0.929524 1.758597 0.896329
C  -1.090517 0.602674 -0.58502
C  -0.291371 2.398397 0.79511
C  -1.305024 1.818379 0.048226
C  4.202013 -2.945423 0.696111
C  5.593197 -2.468454 2.158881
C  -3.651991 1.849841 -0.227171
C  -4.024674 0.796873 0.598456
C  -4.514119 2.304806 -1.212181
C  -5.260694 0.196204 0.430238
C  -5.755761 1.711006 -1.372809
C  -6.122132 0.655068 -0.554562
H  3.566009 1.157189 -1.774482
H  1.668713 -2.035674 1.043803
H  2.126762 -0.989244 2.387918
H  5.402014 0.277437 0.49916
H  4.891285 1.922446 0.065278
H  5.834754 0.353974 -2.380767
H  5.558748 -1.156435 -1.505806
H  4.614079 -0.775251 -2.953001
H  1.712519 2.220954 1.47944
H  -1.864436 0.140284 -1.182623
H  -0.459636 3.346401 1.287763
H  3.666719 -3.351065 -0.14791
H  6.49852 -2.465014 2.745575
H  -3.359635 0.44434 1.376194
H  -4.216824 3.128416 -1.847472
H  -5.555024 -0.622823 1.071565
H  -6.431454 2.066722 -2.137924
totalener: -2044.67070255 hartree
nucrepener: 2710.45342857 hartree
electener: -4755.12413112 hartree
oneelecener: -8190.98166298 hartree
twoeener: 3435.85753186 hartree
kineticenergy: 2038.71716657 hartree
xcener: -149.990255659141 hartree
chargesum: -0.0000000
charge: -0.065964 -0.076466 -0.355251 -0.355661 -0.295848 0.125904 -0.308830 -0.333518 0.545952 0.148279 -0.134300 0.001398 -0.122859 -0.265036 -0.002185 -0.087485 -0.167558 -0.217413 0.235177 0.016288 0.050734 0.241802 -0.171665 -0.213450 -0.107131 -0.088282 0.059513 0.070225 0.135057 0.119084 0.074141 0.088415 0.086224 0.087654 0.095510 0.137726 0.124996 0.130072 0.146473 0.130703 0.138002 0.130005 0.125536 0.124034
qa: -0.0660 -0.0765 -0.3553 -0.3557 -0.2958 0.1259 -0.3088 -0.3335 0.5460 0.1483 -0.1343 0.0014 -0.1229 -0.2650 -0.0022 -0.0875 -0.1676 -0.2174 0.2352 0.0163 0.0507 0.2418 -0.1717 -0.2134 -0.1071 -0.0883 0.0595 0.0702 0.1351 0.1191 0.0741 0.0884 0.0862 0.0877 0.0955 0.1377 0.1250 0.1301 0.1465 0.1307 0.1380 0.1300 0.1255 0.1240
va: 1.2571 1.2280 2.0048 2.0146 2.1146 3.3340 2.8578 3.0303 3.8684 3.8781 3.8051 4.0058 3.6660 3.9632 4.0317 3.9276 3.9749 4.0524 3.8584 4.0760 4.0406 3.8193 3.9731 4.0513 3.9826 3.9635 3.9473 1.0031 1.0183 1.0279 0.9964 1.0013 1.0064 1.0115 1.0057 1.0294 1.0250 1.0147 1.0097 1.0022 1.0005 1.0118 1.0101 1.0092
dispcorr: -0.024743916 hartree
energy: -2044.695446465799
dipole: 32.09757 -32.44393 -0.34636 5.82353 -4.70305 1.12048 0.83475 -1.36728 -0.53253
magnitude: 1.28803 au
magnitude: 3.27391 debye
