program: Orca
programVersion: 5.0.4
elementType: C C C C C N C C C C H C N C C H C O C O N N C H H H C H H H C H H H C H H H Gd N O O O N O O O N O O O H H C N C N
elementType: Gd
keywords: def2-SVPD def2/JK def2/J def2-SVPD/C PBE rijcosx rhf hcore XYZFile VeryTightSCF freq cpcm(water) D3 defgrid3
charge: 0
multiplicity: 1
frequency: 0.00 0.00 0.00 0.00 0.00 0.00 13.25 22.68 29.75 31.40 35.85 40.02 46.35 50.66 54.48 71.67 73.46 76.87 86.35 87.42 89.21 93.05 101.01 107.25 110.60 113.30 117.14 122.92 126.04 132.45 139.10 155.81 157.25 167.45 168.70 170.72 173.93 181.99 187.52 188.39 197.10 203.06 208.36 212.85 236.92 247.94 253.17 278.94 285.48 287.03 299.42 325.88 337.24 364.07 391.53 398.04 411.82 418.11 433.34 446.50 455.10 477.74 491.68 497.96 503.98 527.26 554.78 600.80 616.89 628.46 661.76 671.37 673.56 701.33 701.84 703.66 703.95 714.86 734.02 737.14 738.45 741.91 742.60 751.00 797.34 797.88 798.02 798.96 831.92 837.13 844.35 850.76 881.12 934.31 965.65 968.35 973.04 982.22 1044.98 1045.80 1052.63 1055.29 1057.19 1059.39 1070.76 1071.47 1101.96 1109.87 1119.68 1120.57 1130.46 1143.53 1174.66 1200.16 1215.50 1240.43 1252.20 1272.23 1274.20 1280.92 1290.53 1294.66 1349.88 1359.42 1373.11 1375.08 1376.98 1381.61 1382.66 1394.37 1394.54 1395.81 1397.38 1406.62 1410.53 1410.80 1416.25 1420.80 1422.94 1448.94 1467.70 1468.92 1475.49 1478.99 1493.16 1494.31 1501.19 1564.02 1584.56 1593.55 1610.40 1618.86 1625.75 2270.17 2274.97 2978.67 2979.57 2982.40 2983.95 3063.82 3065.29 3069.10 3069.14 3112.68 3113.55 3121.42 3122.52 3139.37 3140.76 3169.08 3175.53
frequency: 13.25 22.68 29.75 31.40 35.85 40.02 46.35 50.66 54.48 71.67 73.46 76.87 86.35 87.42 89.21 93.05 101.01 107.25 110.60 113.30 117.14 122.92 126.04 132.45 139.10 155.81 157.25 167.45 168.70 170.72 173.93 181.99 187.52 188.39 197.10 203.06 208.36 212.85 236.92 247.94 253.17 278.94 285.48 287.03 299.42 325.88 337.24 364.07 391.53 398.04 411.82 418.11 433.34 446.50 455.10 477.74 491.68 497.96 503.98 527.26 554.78 600.80 616.89 628.46 661.76 671.37 673.56 701.33 701.84 703.66 703.95 714.86 734.02 737.14 738.45 741.91 742.60 751.00 797.34 797.88 798.02 798.96 831.92 837.13 844.35 850.76 881.12 934.31 965.65 968.35 973.04 982.22 1044.98 1045.80 1052.63 1055.29 1057.19 1059.39 1070.76 1071.47 1101.96 1109.87 1119.68 1120.57 1130.46 1143.53 1174.66 1200.16 1215.50 1240.43 1252.20 1272.23 1274.20 1280.92 1290.53 1294.66 1349.88 1359.42 1373.11 1375.08 1376.98 1381.61 1382.66 1394.37 1394.54 1395.81 1397.38 1406.62 1410.53 1410.80 1416.25 1420.80 1422.94 1448.94 1467.70 1468.92 1475.49 1478.99 1493.16 1494.31 1501.19 1564.02 1584.56 1593.55 1610.40 1618.86 1625.75 2270.17 2274.97 2978.67 2979.57 2982.40 2983.95 3063.82 3065.29 3069.10 3069.14 3112.68 3113.55 3121.42 3122.52 3139.37 3140.76 3169.08 3175.53
formula: C20H16GdN9O11
InChI: InChI=1/C20H16N6O2.Gd.3NO3/c1-25(2)19(27)15-7-5-11-13(9-21)14(10-22)12-6-8-16(20(28)26(3)4)24-18(12)17(11)23-15;;3*2-1(3)4/h5-8H,1-4H3;;;;/q-4;+10;3*-2/rC20H16GdN9O11/c1-24(2)19-15-7-5-11-13(9-22)14(10-23)12-6-8-16-20(25(3)4)35-21(34-19,36-28(31)37-21,38-29(32)39-21,40-30(33)41-21)26(15)17(11)18(12)27(16)21/h5-8H,1-4H3
57 atoms
C  -2.33537 -2.983757 -2.828504
C  -1.581613 -1.99733 -3.453194
C  -2.409733 -3.015741 -1.414665
C  -0.923452 -1.028868 -2.658829
C  -1.690737 -2.017892 -0.696187
N  -0.983713 -1.056748 -1.321805
C  -3.136087 -4.02029 -0.670155
C  -3.0981 -4.048141 0.728501
C  -2.331847 -3.071736 1.469696
C  -1.649764 -2.048017 0.751693
H  -1.478016 -1.99733 -4.543384
C  -2.182599 -3.087407 2.877896
N  -0.914083 -1.108401 1.371438
C  -0.819454 -1.096877 2.704778
C  -1.423063 -2.102764 3.498479
H  -1.275059 -2.134625 4.582402
C  0.043548 0.019466 -3.160889
O  1.017342 0.28545 -2.39717
C  0.089066 0.010174 3.191056
O  0.961357 0.418351 2.369378
N  -0.117805 0.615406 -4.348117
N  -0.017812 0.528251 4.42186
C  -1.337064 0.572212 -5.154704
H  -1.201224 -0.078825 -6.039331
H  -2.196493 0.23254 -4.557497
H  -1.548391 1.599213 -5.501847
C  0.919624 1.529853 -4.822914
H  1.885412 1.269949 -4.364346
H  0.983918 1.44258 -5.921319
H  0.655191 2.572631 -4.559358
C  -1.149476 0.339479 5.329493
H  -2.04422 0.001384 4.785465
H  -0.896231 -0.375067 6.135978
H  -1.378695 1.318009 5.786866
C  0.985725 1.494823 4.867373
H  0.609813 2.526569 4.723641
H  1.172793 1.328365 5.942738
H  1.915155 1.359573 4.294697
Gd 0.515846 0.598091 -0.016086
N  2.843774 -1.221059 0.099483
O  3.815527 -1.973768 0.155992
O  2.973516 0.052861 0.099397
O  1.646259 -1.667344 0.036555
N  -2.022981 2.069236 -0.520032
O  -3.054531 2.707179 -0.732403
O  -1.062724 2.039985 -1.367726
O  -1.849806 1.397938 0.552172
N  1.41856 3.442995 0.095951
O  1.761954 4.626915 0.122655
O  0.585524 2.9636 0.94002
O  1.872754 2.626432 -0.775328
H  -2.653273 -3.878446 3.476688
H  -2.850304 -3.746471 -3.427682
C  -3.890043 -5.006162 -1.380713
N  -4.504678 -5.805639 -1.97823
C  -3.814274 -5.060976 1.440143
N  -4.396913 -5.882725 2.039502
elementType: C N H O Gd
totalener: -2124.29736755 hartree
nucrepener: 5238.07819342 hartree
electener: -7362.37556097 hartree
twoeener: 5980.69347821 hartree
cpcmener: -0.09994977 hartree
kineticenergy: 2079.21949961 hartree
exchangeener: -262.628479465431 hartree
correlationener: -10.176458003398 hartree
xcener: -272.804937468828 hartree
chargesum: 0.0000000
charge: 0.244642 -0.523177 -0.651429 -0.223866 -0.384798 0.078706 -0.261581 -0.256682 -0.670075 -0.053052 0.070097 0.127567 -0.112316 -0.199004 -0.491748 0.099134 0.862894 -1.038182 0.847825 -1.093270 -1.416271 -1.333069 0.922635 0.092504 -0.033735 -0.134225 1.052215 -0.104533 -0.071952 0.061877 0.881071 0.003183 0.112076 -0.185566 1.007443 0.044828 -0.035114 -0.110905 3.616342 0.550470 -0.428074 -0.606343 -0.621185 0.529063 -0.437082 -0.550145 -0.550800 0.560311 -0.445835 -0.592326 -0.536408 1.067707 1.110117 0.190663 -0.097571 0.215393 -0.098442
charge: 0.127787 0.120847 -0.027815 0.002525 0.014517 -0.027938 -0.082009 -0.082213 -0.027409 0.010268 0.037982 0.126172 -0.035147 0.007026 0.120456 0.033366 -0.044256 -0.302526 -0.014414 -0.308054 -0.196818 -0.198618 0.245504 0.027055 0.007417 0.023519 0.252891 0.005134 0.022717 0.031557 0.244608 0.007856 0.027605 0.022695 0.251437 0.031330 0.023760 0.003831 1.647669 -0.370115 -0.035455 -0.172943 -0.174671 -0.363257 -0.038026 -0.167781 -0.171747 -0.373948 -0.046530 -0.165843 -0.167841 0.043216 0.043790 -0.063848 0.079324 -0.063735 0.079095
qa: 0.2446 -0.5232 -0.6514 -0.2239 -0.3848 0.0787 -0.2616 -0.2567 -0.6701 -0.0531 0.0701 0.1276 -0.1123 -0.1990 -0.4917 0.0991 0.8629 -1.0382 0.8478 -1.0933 -1.4163 -1.3331 0.9226 0.0925 -0.0337 -0.1342 1.0522 -0.1045 -0.0720 0.0619 0.8811 0.0032 0.1121 -0.1856 1.0074 0.0448 -0.0351 -0.1109 3.6163 0.5505 -0.4281 -0.6063 -0.6212 0.5291 -0.4371 -0.5501 -0.5508 0.5603 -0.4458 -0.5923 -0.5364 1.0677 1.1101 0.1907 -0.0976 0.2154 -0.0984
va: 3.9566 4.4152 5.4455 4.4366 5.2570 4.8900 5.6105 5.5661 5.7878 4.9663 1.6159 3.9675 5.1574 4.4579 4.5610 1.6603 3.1748 1.5047 3.0030 1.5491 5.5198 5.4390 3.7578 0.8481 1.0533 0.9247 3.5835 1.1086 0.9069 0.8558 3.7993 1.0163 0.8411 0.9565 3.6030 0.8641 0.9097 1.1268 -1.7874 4.0556 1.7925 1.5000 1.5797 4.1118 1.7940 1.2115 1.4877 4.0591 1.7751 1.3766 1.4440 0.0629 -0.0467 4.1815 2.5070 4.1496 2.5049
dispersion: -0.091035429 hartree
energy: -2124.388402976061 hartree
dipole: -121.55481 117.96558 -3.58923 -113.59411 110.27167 -3.32244 0.88705 -0.33960 0.54745
magnitude: 4.92147 au
magnitude: 12.50939 debye
temp: 298.15 k
press: 1.00 atm
zeropoint: 0.37352763 hartree
thermalvibcorrection: 0.03831294 hartree
thermalrotcorrection: 0.00141627 hartree
thermaltrasncorrection: 0.00141627 hartree
thermaltotal: -2123.97372986 hartree
thermalcorr: 0.04114548 hartree
nonthermalcorr: 0.37352763 hartree
totalcorr: 0.41467311 hartree
thermalcorrenthalpy: 0.00094421 hartree
totalenthalpy: -2123.97278565 hartree
vibrat: 0.07122876 hartree
rotat: 0.01795323 hartree
transl: 0.02165849 hartree
total: 0.11084048 hartree
totalentropycorr: -0.11084048 hartree
gibbsenthalpy: -2124.08362614 hartree
gibbsminuselec: 0.30477684 hartree
