program: Orca
programVersion: 5.0.4
elementType: C C C C C N C C C C H C N C C H C O C O N N C H H H C H H H C H H H C H H H Eu N O O O N O O O N O O O H H C N C N
elementType: Eu
keywords: def2-SVPD def2/JK def2/J def2-SVPD/C PBE rijcosx rhf hcore XYZFile VeryTightSCF freq cpcm(water) D3 defgrid3
charge: 0
multiplicity: 1
frequency: 0.00 0.00 0.00 0.00 0.00 0.00 12.95 22.99 29.01 31.77 36.59 39.81 44.73 49.06 54.77 71.77 72.67 77.21 85.92 87.50 88.30 92.12 100.87 105.84 109.95 112.33 116.53 120.23 125.96 129.65 136.65 153.42 156.72 166.75 167.45 169.21 173.49 181.34 187.58 189.93 198.33 204.72 208.47 212.80 236.14 248.12 252.75 279.02 285.19 286.60 299.25 326.23 337.33 363.88 391.37 397.61 411.77 417.81 432.80 445.58 455.17 476.79 491.38 497.15 502.94 527.01 555.09 600.48 617.30 628.54 661.76 671.10 673.23 701.21 701.92 703.71 703.98 715.23 733.14 736.29 738.23 741.07 742.36 751.33 797.36 797.57 798.02 798.90 832.25 836.94 844.57 850.94 881.01 934.22 965.59 968.48 973.00 981.91 1045.35 1045.42 1051.62 1054.61 1056.51 1059.23 1070.78 1071.42 1101.85 1109.88 1119.78 1120.64 1130.57 1143.61 1174.58 1200.28 1215.82 1240.43 1252.33 1270.02 1274.15 1278.84 1288.77 1294.70 1349.78 1359.18 1373.02 1374.97 1377.23 1381.71 1382.67 1394.34 1394.66 1395.88 1397.22 1406.21 1410.52 1410.89 1416.28 1421.08 1423.08 1448.89 1467.20 1469.10 1475.97 1478.63 1493.51 1494.01 1501.10 1563.78 1584.54 1593.53 1610.37 1618.50 1625.62 2270.16 2274.95 2978.72 2979.54 2982.44 2983.85 3063.76 3065.08 3068.91 3069.48 3112.67 3113.52 3121.08 3122.87 3139.33 3140.71 3167.91 3174.67
frequency: 12.95 22.99 29.01 31.77 36.59 39.81 44.73 49.06 54.77 71.77 72.67 77.21 85.92 87.50 88.30 92.12 100.87 105.84 109.95 112.33 116.53 120.23 125.96 129.65 136.65 153.42 156.72 166.75 167.45 169.21 173.49 181.34 187.58 189.93 198.33 204.72 208.47 212.80 236.14 248.12 252.75 279.02 285.19 286.60 299.25 326.23 337.33 363.88 391.37 397.61 411.77 417.81 432.80 445.58 455.17 476.79 491.38 497.15 502.94 527.01 555.09 600.48 617.30 628.54 661.76 671.10 673.23 701.21 701.92 703.71 703.98 715.23 733.14 736.29 738.23 741.07 742.36 751.33 797.36 797.57 798.02 798.90 832.25 836.94 844.57 850.94 881.01 934.22 965.59 968.48 973.00 981.91 1045.35 1045.42 1051.62 1054.61 1056.51 1059.23 1070.78 1071.42 1101.85 1109.88 1119.78 1120.64 1130.57 1143.61 1174.58 1200.28 1215.82 1240.43 1252.33 1270.02 1274.15 1278.84 1288.77 1294.70 1349.78 1359.18 1373.02 1374.97 1377.23 1381.71 1382.67 1394.34 1394.66 1395.88 1397.22 1406.21 1410.52 1410.89 1416.28 1421.08 1423.08 1448.89 1467.20 1469.10 1475.97 1478.63 1493.51 1494.01 1501.10 1563.78 1584.54 1593.53 1610.37 1618.50 1625.62 2270.16 2274.95 2978.72 2979.54 2982.44 2983.85 3063.76 3065.08 3068.91 3069.48 3112.67 3113.52 3121.08 3122.87 3139.33 3140.71 3167.91 3174.67
formula: C20H16EuN9O11
InChI: InChI=1/C20H16N6O2.Eu.3NO3/c1-25(2)19(27)15-7-5-11-13(9-21)14(10-22)12-6-8-16(20(28)26(3)4)24-18(12)17(11)23-15;;3*2-1(3)4/h5-8H,1-4H3;;;;/q-4;+10;3*-2/rC20H16EuN9O11/c1-24(2)19-15-7-5-11-13(9-22)14(10-23)12-6-8-16-20(25(3)4)35-21(34-19,28(31,36-21)37-21,29(32,38-21)39-21,30(33,40-21)41-21)26(15)17(11)18(12)27(16)21/h5-8H,1-4H3
57 atoms
C  -2.333739 -2.991481 -2.830596
C  -1.58615 -2.001154 -3.456225
C  -2.402844 -3.025927 -1.416575
C  -0.927094 -1.03327 -2.662013
C  -1.684252 -2.027175 -0.698475
N  -0.98058 -1.063834 -1.324771
C  -3.125024 -4.03343 -0.672208
C  -3.086158 -4.061703 0.726323
C  -2.322988 -3.082916 1.467377
C  -1.642612 -2.057584 0.749657
H  -1.487584 -1.997185 -4.546971
C  -2.176763 -3.097441 2.87591
N  -0.910197 -1.115612 1.370096
C  -0.820496 -1.102642 2.703783
C  -1.422685 -2.109358 3.497358
H  -1.277634 -2.13814 4.581868
C  0.034721 0.017404 -3.168695
O  1.019307 0.27555 -2.416379
C  0.081212 0.007589 3.194971
O  0.966614 0.409135 2.384238
N  -0.142618 0.623306 -4.348537
N  -0.047282 0.53591 4.419387
C  -1.37334 0.587585 -5.13787
H  -1.248715 -0.052085 -6.032345
H  -2.22331 0.238178 -4.532782
H  -1.592255 1.618313 -5.46903
C  0.888997 1.541019 -4.829717
H  1.862644 1.2702 -4.394523
H  0.93114 1.470381 -5.930337
H  0.634696 2.580684 -4.544744
C  -1.193617 0.351846 5.309466
H  -2.077238 0.002949 4.754243
H  -0.950758 -0.352385 6.128131
H  -1.435484 1.33431 5.751722
C  0.945626 1.509043 4.874013
H  0.566002 2.538175 4.721562
H  1.119707 1.347754 5.95238
H  1.882957 1.376476 4.313775
Eu 0.54503 0.594269 -0.017865
N  2.868949 -1.248125 0.112546
O  3.834389 -2.007662 0.180925
O  3.008899 0.025033 0.107834
O  1.668658 -1.686306 0.0412
N  -1.992318 2.100377 -0.484982
O  -3.02073 2.747854 -0.682763
O  -1.050213 2.052032 -1.352232
O  -1.805206 1.438135 0.590791
N  1.502428 3.43634 0.065386
O  1.863607 4.615169 0.083571
O  0.689011 2.967964 0.935101
O  1.917217 2.615419 -0.820993
H  -2.646376 -3.889579 3.474079
H  -2.848765 -3.754686 -3.429057
C  -3.877336 -5.020731 -1.382533
N  -4.490553 -5.821583 -1.979669
C  -3.798292 -5.077492 1.437839
N  -4.377575 -5.901814 2.03692
elementType: C N H O Eu
totalener: -2123.70837381 hartree
nucrepener: 5227.88423045 hartree
electener: -7351.59260425 hartree
twoeener: 5970.07098209 hartree
cpcmener: -0.09985988 hartree
kineticenergy: 2078.93257874 hartree
exchangeener: -262.565698048847 hartree
correlationener: -10.173711968281 hartree
xcener: -272.739410017128 hartree
chargesum: -0.0000000
charge: 0.275242 -0.505385 -0.668094 -0.231706 -0.379338 -0.001790 -0.264476 -0.266462 -0.682764 -0.069864 0.058702 0.160976 -0.153437 -0.214357 -0.482829 0.087732 0.852909 -1.099428 0.839933 -1.127477 -1.423484 -1.341835 0.927885 0.088319 -0.037044 -0.126728 1.051260 -0.103949 -0.070950 0.064036 0.886326 0.000196 0.105273 -0.177954 1.016050 0.042659 -0.036018 -0.115758 3.971049 0.551167 -0.420266 -0.619465 -0.648209 0.530112 -0.433138 -0.578795 -0.577058 0.558323 -0.443292 -0.626435 -0.568681 1.092952 1.127319 0.192990 -0.097790 0.211393 -0.098550
charge: 0.127437 0.120370 -0.028260 0.000649 0.013749 -0.028346 -0.082230 -0.082421 -0.027810 0.009809 0.038558 0.125926 -0.034806 0.004800 0.119891 0.034144 -0.045858 -0.305399 -0.016580 -0.311206 -0.197166 -0.198990 0.245456 0.026938 0.007351 0.023600 0.252673 0.005319 0.022528 0.031409 0.244666 0.007811 0.027468 0.022681 0.251408 0.031193 0.023823 0.003496 1.687559 -0.371669 -0.035524 -0.174824 -0.177599 -0.364722 -0.038265 -0.170757 -0.173974 -0.375607 -0.047315 -0.169410 -0.169596 0.043224 0.043785 -0.063931 0.079296 -0.063825 0.079073
qa: 0.2752 -0.5054 -0.6681 -0.2317 -0.3793 -0.0018 -0.2645 -0.2665 -0.6828 -0.0699 0.0587 0.1610 -0.1534 -0.2144 -0.4828 0.0877 0.8529 -1.0994 0.8399 -1.1275 -1.4235 -1.3418 0.9279 0.0883 -0.0370 -0.1267 1.0513 -0.1039 -0.0709 0.0640 0.8863 0.0002 0.1053 -0.1780 1.0161 0.0427 -0.0360 -0.1158 3.9710 0.5512 -0.4203 -0.6195 -0.6482 0.5301 -0.4331 -0.5788 -0.5771 0.5583 -0.4433 -0.6264 -0.5687 1.0930 1.1273 0.1930 -0.0978 0.2114 -0.0985
va: 3.9273 4.4220 5.4207 4.4779 5.2428 4.9243 5.6275 5.5847 5.7333 4.9635 1.6061 3.9554 5.1965 4.4765 4.5707 1.6451 3.2251 1.4453 3.0174 1.4320 5.5285 5.4399 3.7538 0.8512 1.0571 0.9221 3.5813 1.1085 0.9085 0.8569 3.7935 1.0218 0.8477 0.9519 3.5933 0.8628 0.9054 1.1294 -2.6809 4.0495 1.7965 1.5504 1.5777 4.0927 1.7978 1.2123 1.4809 4.0527 1.7766 1.3835 1.4758 0.0002 -0.0862 4.1799 2.5078 4.1529 2.5054
dispersion: -0.089058365 hartree
energy: -2123.797432173282 hartree
dipole: -119.97566 116.20621 -3.76945 -109.39086 106.10255 -3.28832 1.11443 -0.59790 0.51653
magnitude: 5.02877 au
magnitude: 12.78213 debye
temp: 298.15 k
press: 1.00 atm
zeropoint: 0.37343336 hartree
thermalvibcorrection: 0.03835906 hartree
thermalrotcorrection: 0.00141627 hartree
thermaltrasncorrection: 0.00141627 hartree
thermaltotal: -2123.38280721 hartree
thermalcorr: 0.04119160 hartree
nonthermalcorr: 0.37343336 hartree
totalcorr: 0.41462496 hartree
thermalcorrenthalpy: 0.00094421 hartree
totalenthalpy: -2123.38186300 hartree
vibrat: 0.07135689 hartree
rotat: 0.01795809 hartree
transl: 0.02164799 hartree
total: 0.11096296 hartree
totalentropycorr: -0.11096296 hartree
gibbsenthalpy: -2123.49282596 hartree
gibbsminuselec: 0.30460621 hartree
