program: Orca
programVersion: 4.2.1
elementType: Cl Cl O O O N N N C C C C C C C C C C C C C C C C C C C H H H H H H H H H H H H H H H H H
charge: 0
multiplicity: 1
keywords: wb97x-d3
keywords: def2-TZVPP
keywords: def2/J RIJCOSX GRIDX6 NOFINALGRIDX
keywords: grid4 nofinalgrid
keywords: scfconv7
keywords: smallprint printgap noloewdin
keywords: NOSOSCF
formula: C19H17Cl2N3O3
InChI: InChI=1/C19H17Cl2N3O3/c1-13-9-25-19(27-13,10-24-12-22-11-23-24)17-7-6-16(8-18(17)21)26-15-4-2-14(20)3-5-15/h2-8,11-13H,9-10H2,1H3
44 atoms
Cl -0.021608 -1.984509 0.441683
Cl -7.505213 0.229517 -1.783379
O  2.617013 -1.199881 -0.589562
O  3.510423 0.776231 -0.054385
O  -2.53471 2.40942 0.411209
N  4.20157 -1.276382 1.767475
N  4.33607 -2.604083 1.702061
N  6.348366 -1.615198 1.740344
C  2.543641 -0.15708 0.32939
C  3.358015 -0.798245 -1.731452
C  2.908654 -0.65363 1.733393
C  3.627789 0.683349 -1.458026
C  1.154671 0.479076 0.346485
C  4.610999 -1.638784 -1.873053
C  -0.027921 -0.25725 0.379429
C  1.032622 1.865944 0.362585
C  -1.272661 0.354593 0.393324
C  -0.195134 2.500855 0.365636
C  -1.354226 1.739486 0.372158
C  5.413899 -0.70127 1.784165
C  5.635814 -2.761826 1.691605
C  -3.664751 1.851663 -0.115705
C  -3.689677 1.314837 -1.396504
C  -4.820736 1.892625 0.647698
C  -4.873967 0.811386 -1.907192
C  -6.008624 1.39956 0.131843
C  -6.029413 0.855278 -1.141614
H  2.727528 -0.921709 -2.617435
H  2.180078 -1.384031 2.077294
H  2.889813 0.191476 2.423298
H  4.630594 1.001367 -1.74463
H  2.897643 1.329654 -1.959385
H  5.315426 -1.456426 -1.060596
H  4.365297 -2.699857 -1.874145
H  5.113525 -1.410341 -2.814247
H  1.928824 2.470607 0.360139
H  -2.164686 -0.256389 0.427448
H  -0.259223 3.580584 0.365505
H  5.561363 0.365755 1.833588
H  6.089515 -3.739642 1.651169
H  -2.791952 1.288994 -2.000809
H  -4.79217 2.317389 1.642329
H  -4.897541 0.392255 -2.903303
H  -6.912231 1.433693 0.72445
totalener: -2044.66869574 hartree
nucrepener: 2713.29319502 hartree
electener: -4757.96189076 hartree
oneelecener: -8196.74906433 hartree
twoeener: 3438.78717357 hartree
kineticenergy: 2038.71182311 hartree
xcener: -149.988186473511 hartree
chargesum: 0.0000000
charge: -0.046760 -0.076202 -0.330221 -0.362417 -0.295447 0.114829 -0.286346 -0.332898 0.578272 0.161496 -0.136533 -0.042898 -0.146532 -0.282165 -0.025042 -0.109494 -0.167616 -0.226348 0.247187 0.025737 0.048388 0.244648 -0.175875 -0.212221 -0.103914 -0.087423 0.056658 0.063926 0.134411 0.126295 0.096382 0.093289 0.087099 0.103074 0.087605 0.139826 0.123421 0.128983 0.138833 0.128386 0.136469 0.130746 0.125665 0.124727
qa: -0.0468 -0.0762 -0.3302 -0.3624 -0.2954 0.1148 -0.2863 -0.3329 0.5783 0.1615 -0.1365 -0.0429 -0.1465 -0.2822 -0.0250 -0.1095 -0.1676 -0.2263 0.2472 0.0257 0.0484 0.2446 -0.1759 -0.2122 -0.1039 -0.0874 0.0567 0.0639 0.1344 0.1263 0.0964 0.0933 0.0871 0.1031 0.0876 0.1398 0.1234 0.1290 0.1388 0.1284 0.1365 0.1307 0.1257 0.1247
va: 1.2780 1.2283 2.0409 1.9932 2.1165 3.3528 2.8675 3.0386 3.8513 3.9135 3.8035 3.9756 3.6321 3.9503 4.1101 3.8921 3.9553 4.0625 3.8527 4.0754 4.0425 3.8141 3.9787 4.0551 3.9816 3.9647 3.9501 0.9967 1.0336 1.0048 1.0009 0.9953 1.0096 1.0089 1.0105 1.0239 1.0280 1.0151 1.0130 1.0038 1.0014 1.0120 1.0104 1.0091
dispcorr: -0.024896252 hartree
energy: -2044.693591989473
dipole: 30.72183 -31.21723 -0.49540 4.68493 -3.29504 1.38988 -3.40775 2.76108 -0.64667
magnitude: 1.61102 au
magnitude: 4.09488 debye
