program: Orca
programVersion: 4.2.1
elementType: Cl Cl O O O N N N C C C C C C C C C C C C C C C C C C C H H H H H H H H H H H H H H H H H
charge: 0
multiplicity: 1
keywords: wb97x-d3
keywords: def2-TZVPP
keywords: def2/J RIJCOSX GRIDX6 NOFINALGRIDX
keywords: grid4 nofinalgrid
keywords: scfconv7
keywords: smallprint printgap noloewdin
keywords: NOSOSCF
formula: C19H17Cl2N3O3
InChI: InChI=1/C19H17Cl2N3O3/c1-13-9-25-19(27-13,10-24-12-22-11-23-24)17-7-6-16(8-18(17)21)26-15-4-2-14(20)3-5-15/h2-8,11-13H,9-10H2,1H3
44 atoms
Cl 1.711458 -0.617871 2.723629
Cl -7.651913 -0.400477 -1.938776
O  3.49783 -0.098448 0.423374
O  2.729212 0.935364 -1.385825
O  -2.571859 -1.921257 0.549288
N  3.747983 2.663084 0.676797
N  4.597759 2.520929 1.697205
N  5.575823 3.632145 0.009871
C  2.450466 0.697913 -0.035846
C  3.946532 -0.917918 -0.653719
C  2.44807 2.046204 0.686113
C  3.352898 -0.231942 -1.894477
C  1.094438 0.013732 0.134228
C  3.511371 -2.359174 -0.501468
C  0.697744 -0.603628 1.319595
C  0.183313 -0.00477 -0.917599
C  -0.536383 -1.216859 1.450431
C  -1.051341 -0.625307 -0.822775
C  -1.406114 -1.235001 0.371301
C  4.346387 3.317324 -0.319188
C  5.669748 3.120326 1.251635
C  -3.724094 -1.514747 -0.073701
C  -4.098877 -0.179117 -0.138328
C  -4.551131 -2.506382 -0.579015
C  -5.30886 0.163563 -0.720649
C  -5.767487 -2.164947 -1.148899
C  -6.1356 -0.830942 -1.220192
H  5.037435 -0.864855 -0.661187
H  2.137823 1.938001 1.722751
H  1.731371 2.706664 0.198518
H  4.109928 0.067178 -2.618564
H  2.626624 -0.876532 -2.401194
H  3.888713 -2.791932 0.425002
H  3.909318 -2.949794 -1.328078
H  2.424973 -2.458419 -0.514587
H  0.442105 0.470386 -1.85343
H  -0.821611 -1.687746 2.381923
H  -1.711751 -0.631245 -1.679392
H  3.853031 3.560166 -1.246689
H  6.562624 3.196413 1.852455
H  -3.466776 0.600066 0.267878
H  -4.25353 -3.545301 -0.522218
H  -5.602123 1.203096 -0.769714
H  -6.413886 -2.939224 -1.53885
elementType: Cl O N C H
totalener: -2044.68787633 hartree
nucrepener: 2705.62500620 hartree
electener: -4750.31288254 hartree
oneelecener: -8181.64829909 hartree
twoeener: 3431.33541656 hartree
cpcmener: -0.03566624 hartree
kineticenergy: 2038.70107490 hartree
xcener: -149.988184765993 hartree
chargesum: -0.0000000
charge: -0.080191 -0.101829 -0.373640 -0.396550 -0.332031 0.118448 -0.350213 -0.423086 0.608073 0.208306 -0.102226 -0.044189 -0.218614 -0.301683 0.033942 -0.099603 -0.226801 -0.224062 0.272642 0.068906 0.054750 0.302683 -0.203898 -0.262126 -0.127181 -0.105566 0.063179 0.090085 0.134252 0.144592 0.110031 0.098992 0.089944 0.107838 0.081853 0.154939 0.129199 0.159438 0.169061 0.161973 0.160742 0.152391 0.148904 0.148330
qa: -0.0802 -0.1018 -0.3736 -0.3965 -0.3320 0.1184 -0.3502 -0.4231 0.6081 0.2083 -0.1022 -0.0442 -0.2186 -0.3017 0.0339 -0.0996 -0.2268 -0.2241 0.2726 0.0689 0.0547 0.3027 -0.2039 -0.2621 -0.1272 -0.1056 0.0632 0.0901 0.1343 0.1446 0.1100 0.0990 0.0899 0.1078 0.0819 0.1549 0.1292 0.1594 0.1691 0.1620 0.1607 0.1524 0.1489 0.1483
va: 1.2381 1.2018 1.9992 1.9731 2.0749 3.3757 2.8896 3.0255 3.8241 3.8375 3.7672 3.9352 3.6331 3.9765 3.9360 3.9098 4.1388 3.9919 3.7873 4.0690 4.0585 3.6737 3.9616 4.0468 3.9612 3.9439 3.8407 0.9987 1.0309 1.0071 1.0023 0.9971 1.0096 1.0074 0.9966 1.0179 1.0279 0.9964 1.0041 0.9953 0.9937 1.0050 1.0024 1.0011
dispcorr: -0.024589410 hartree
energy: -2044.712465744177
dipole: 21.70272 -23.03068 -1.32797 -3.44391 2.30940 -1.13451 -8.83471 7.19667 -1.63804
magnitude: 2.39453 au
magnitude: 6.08641 debye
