program: Gaussian 09
title: 000063271
version: EM64L-G09RevD.01
frameworkgroup: C1[X(C17H10ClF3N2O2)]
method: RPBEPBE
basis: SDD
operation: Freq
keyword: #p
keyword: freq=noraman
keyword: PBEPBE/SDD
title: #p freq=noraman PBEPBE/SDD
converged: YES YES NO NO
title: Mulliken charges:
elementType: Cl F F F O O N N C C C C C C C C C C C C C C C C C H H H H H H H H H H
charge: -0.021904 -0.149151 -0.139755 -0.138035 -0.223580 -0.141402 -0.332726 -0.029419 0.130539 0.161458 0.135260 -0.655211 0.075693 0.563224 -0.318672 -0.355681 -0.311301 -0.286784 0.190522 -0.240513 -0.203196 -0.231213 -0.236268 0.324549 -0.215632 0.317025 0.302953 0.273170 0.263656 0.273574 0.237045 0.236900 0.260577 0.243161 0.241139
chargesum: 0.00000
title: Mulliken charges with hydrogens summed into heavy atoms:
elementType: Cl F F F O O N N C C C C C C C C C C C C C C C C C
charge: -0.021904 -0.149151 -0.139755 -0.138035 -0.223580 -0.141402 -0.332726 -0.029419 0.130539 0.161458 0.135260 -0.035232 0.075693 0.563224 -0.045503 -0.092025 -0.311301 -0.013210 0.190522 -0.003468 0.033704 0.029364 0.006893 0.324549 0.025506
polarizability: 2.73412027e+02 4.81912219e+01 2.02226010e+02 -7.95200561e+00 -1.76205670e+01 1.63250487e+02
1716.lowfreq: -22.6813 -4.4903 -4.0347 -0.0013 0.0005 0.0014 1.6542 16.1148 22.6971
frequency: -22.5890 15.5364 22.6603 33.3576 40.1222 62.6818 80.9810 104.4271 117.7557 143.5728 161.6203 170.7507 201.2869 219.3203 260.0255 269.8990 286.2705 301.7877 310.1413 335.1860 375.6305 388.2287 424.0536 427.5462 454.8027 458.7100 486.1405 503.5913 508.0675 531.2421 537.9370 552.9370 561.1312 611.5369 620.8820 642.5231 654.0099 676.9905 691.4609 701.7765 719.5017 763.1436 784.8458 794.0381 818.1264 838.0250 850.1362 873.1453 899.8633 927.3213 953.8780 966.2729 980.9025 992.3442 1002.3441 1004.9778 1021.1692 1025.3153 1026.1335 1038.0077 1047.4698 1070.1855 1103.2850 1126.2810 1164.1580 1168.2004 1170.9107 1174.6307 1215.6440 1237.4920 1243.0519 1267.1843 1288.7692 1323.9075 1342.6690 1370.3311 1392.6254 1401.7234 1426.7437 1452.4798 1459.5763 1465.4387 1561.6740 1566.9360 1580.3420 1601.9307 1614.9479 1630.2151 1664.1825 2999.1199 3053.2713 3138.2768 3146.8018 3152.2869 3160.6078 3166.4000 3172.8101 3175.8725 3182.0547
redmass: 17.6847 11.5505 10.0585 7.4099 8.2906 7.1511 6.1774 9.9749 6.9109 5.8564 8.2664 7.3232 8.4004 8.0713 5.9198 6.5556 7.0496 4.3487 5.9928 4.4819 14.3500 8.2955 9.2123 4.0623 3.4890 7.5416 4.9187 4.4146 10.5513 4.2921 4.5781 9.3403 5.1177 8.2762 5.8011 6.4983 6.7896 7.6737 4.6274 6.6852 4.3343 1.2716 1.6475 3.0072 6.6168 5.0424 3.3374 1.6790 1.5182 3.6837 1.4996 5.0832 1.3762 1.3536 5.4185 1.3384 3.3214 3.8776 4.6216 3.8815 6.4350 3.0739 1.9155 1.5801 1.2792 1.1840 5.1190 1.0569 2.1010 2.8502 2.5545 1.7136 1.7488 2.2400 3.2564 10.5893 10.1148 1.1400 2.1996 2.6872 2.6886 2.7405 8.5963 7.7602 6.7394 7.2403 7.2749 10.7356 10.3418 1.0617 1.0964 1.0863 1.0865 1.0902 1.0908 1.0955 1.0953 1.1001 1.1007
irintensity: 0.0120 0.2686 0.5745 1.5954 0.4486 1.8729 1.6334 2.4913 1.0661 1.3376 1.6334 0.4304 2.6162 2.0052 2.8152 2.3284 1.1964 5.3570 0.5430 3.1916 3.3576 4.6341 3.3248 3.4602 13.0583 6.5084 4.8566 2.5683 0.5980 1.7193 4.4571 4.3364 4.8165 14.4383 20.9101 10.4422 10.0620 5.4085 13.2887 15.9553 7.3973 65.8410 73.9285 9.0129 16.3833 4.4051 2.9399 0.8438 0.8615 58.1627 7.4694 130.0161 2.1979 0.7111 48.9740 0.0196 32.1675 28.2551 109.0620 105.2761 114.7667 25.2346 19.6710 0.7516 6.7996 6.1039 47.7232 0.3580 0.3525 2.3231 41.0606 19.2053 11.1190 48.6921 103.8013 1.7095 29.8083 55.4026 23.4844 27.2592 46.7854 49.6605 143.8472 53.2520 14.5871 6.3558 123.6066 223.8758 53.6521 17.7319 1.0835 4.1302 1.8058 6.7007 9.7537 9.1390 2.9975 22.5403 7.9753
temp: 298.150 k
press: 1.00000 atm
elementType: 17 9 9 9 8 8 7 7 6 6 6 6 6 6 6 6 6 6 6 6 6 6 6 6 6 1 1 1 1 1 1 1 1 1 1
symmnumber: 1
zpe: 614321.7 jmol-1
zpe.correction: 0.233983 hartree
zpe.thermalcorrener: 0.254445 hartree
zpe.thermalcorrenthalpy: 0.255389 hartree
zpe.thermalcorrgfe: 0.181999 hartree
zpe.sumelectzpe: -1671.609862 hartree
zpe.sumelectthermal: -1671.589401 hartree
zpe.sumelectthermalent: -1671.588456 hartree
zpe.sumelectthermalfe: -1671.661846 hartree
dipole: -0.2172 0.7101 0.8824
dipole: 1.1533
quadrupole: -134.4436 -148.8691 -149.9200
quadrupole: 22.1141 -0.4209 -3.3046
quadrupole: 9.9673 -4.4582 -5.5091 22.1141 -0.4209 -3.3046
hfenergy: -1671.8438452 hartree
pointgroup: C01 [X(C17H10Cl1F3N2O2)]
dipole: -0.0795844 0.2729876 0.3535918 debye
polarizability: 277.579949|45.5038824|199.2113808|-5.4690667|-15.4937347|162.0971934 unknown
InChI: InChI=1S/C17H10ClF3N2O2/c18-11-6-2-4-8-13(11)23-15(9-14(24)17(19,20)21)22-12-7-3-1-5-10(12)16(23)25/h1-8H,9H2
charge 0 multiplicity 1
35 atoms
Cl 0.22725 2.187986 2.519877
F  3.551595 -2.178765 1.557355
F  4.357583 -1.471906 -0.445204
F  3.439313 -3.54345 -0.255324
O  -1.839968 2.268834 -0.948809
O  1.614867 -1.57765 -1.43502
N  -0.460575 0.598306 -0.029782
N  -1.324089 -1.530525 0.696691
C  -0.321346 -0.689972 0.522478
C  -2.859133 0.165133 -0.266294
C  -1.744953 1.110492 -0.461001
C  1.057674 -1.158172 0.935392
C  -2.614736 -1.122688 0.308407
C  0.669845 1.498184 -0.16123
C  -4.174763 0.538947 -0.643622
C  -3.699792 -2.020767 0.495805
C  1.084143 2.312731 0.91799
C  1.337743 1.612114 -1.401245
C  1.91932 -1.616999 -0.228439
C  -5.239117 -0.358014 -0.453353
C  -4.998125 -1.639854 0.117461
C  2.153003 3.21828 0.785808
C  2.410072 2.516191 -1.550078
C  3.320403 -2.205695 0.160739
C  2.816869 3.316994 -0.4583
H  0.918377 -2.015433 1.620694
H  1.612226 -0.393846 1.513346
H  -4.327739 1.531888 -1.078553
H  -3.489862 -3.000296 0.935303
H  1.003415 0.987731 -2.235001
H  -6.255682 -0.072949 -0.74356
H  -5.832443 -2.334679 0.262421
H  2.454536 3.835803 1.636492
H  2.922083 2.596149 -2.513738
H  3.646904 4.022295 -0.568805
