program: Orca
programVersion: 4.2.1
elementType: Cl Cl O O O N N N C C C C C C C C C C C C C C C C C C C H H H H H H H H H H H H H H H H H
charge: 0
multiplicity: 1
keywords: wb97x-d3
keywords: def2-TZVPP
keywords: def2/J RIJCOSX GRIDX6 NOFINALGRIDX
keywords: grid4 nofinalgrid
keywords: scfconv7
keywords: smallprint printgap noloewdin
keywords: NOSOSCF
formula: C19H17Cl2N3O3
InChI: InChI=1/C19H17Cl2N3O3/c1-13-9-25-19(27-13,10-24-12-22-11-23-24)17-7-6-16(8-18(17)21)26-15-4-2-14(20)3-5-15/h2-8,11-13H,9-10H2,1H3
44 atoms
Cl 2.102366 -0.236971 2.39907
Cl -7.153148 0.521108 -1.93785
O  3.961496 -0.27305 0.178108
O  3.321203 -0.293892 -1.948906
O  -2.29756 -1.635076 0.533025
N  2.719012 2.366581 0.472873
N  1.471463 2.684479 0.829619
N  2.915174 3.199569 2.469803
C  2.964598 0.186089 -0.681299
C  4.46166 -1.513162 -0.329322
C  3.018669 1.713689 -0.772929
C  3.841251 -1.59475 -1.730741
C  1.571109 -0.314509 -0.296055
C  4.106316 -2.686338 0.555136
C  1.118782 -0.521352 1.004958
C  0.65369 -0.5382 -1.322469
C  -0.17696 -0.944382 1.267213
C  -0.640608 -0.963431 -1.089966
C  -1.050438 -1.166895 0.219117
C  3.560819 2.667056 1.462652
C  1.643468 3.174604 2.028789
C  -3.395996 -1.093858 -0.082755
C  -4.462224 -1.945536 -0.331691
C  -3.482608 0.255927 -0.397976
C  -5.624905 -1.447699 -0.897559
C  -4.641525 0.751551 -0.974181
C  -5.704756 -0.102384 -1.220425
H  5.548457 -1.418457 -0.390528
H  2.311197 2.064836 -1.522485
H  4.018714 2.013641 -1.087042
H  4.56955 -1.815184 -2.509365
H  3.046551 -2.347954 -1.775002
H  4.532606 -3.598021 0.133549
H  3.027459 -2.827321 0.631286
H  4.512364 -2.566554 1.558895
H  0.960054 -0.384997 -2.347919
H  -0.507172 -1.097531 2.28586
H  -1.308401 -1.137012 -1.923355
H  4.624784 2.504545 1.39775
H  0.81185 3.541695 2.609718
H  -4.390071 -2.995429 -0.079998
H  -2.663548 0.933826 -0.196362
H  -6.455469 -2.112755 -1.089244
H  -4.707869 1.802313 -1.220256
elementType: Cl O N C H
totalener: -2044.68570592 hartree
nucrepener: 2787.09827268 hartree
electener: -4831.78397860 hartree
oneelecener: -8345.53841847 hartree
twoeener: 3513.75443987 hartree
cpcmener: -0.03377874 hartree
kineticenergy: 2038.71084761 hartree
xcener: -149.992017019890 hartree
chargesum: -0.0000000
charge: -0.080284 -0.102684 -0.382591 -0.395588 -0.335906 0.099428 -0.348698 -0.405503 0.623407 0.168128 -0.058636 -0.026142 -0.087509 -0.297307 -0.052678 -0.187075 -0.154015 -0.178110 0.207435 0.061750 0.057037 0.290685 -0.258208 -0.184988 -0.106323 -0.137756 0.063119 0.089414 0.129428 0.127290 0.117094 0.092546 0.110019 0.079897 0.092320 0.147860 0.128437 0.160928 0.170733 0.160336 0.152932 0.153898 0.147382 0.148501
qa: -0.0803 -0.1027 -0.3826 -0.3956 -0.3359 0.0994 -0.3487 -0.4055 0.6234 0.1681 -0.0586 -0.0261 -0.0875 -0.2973 -0.0527 -0.1871 -0.1540 -0.1781 0.2074 0.0617 0.0570 0.2907 -0.2582 -0.1850 -0.1063 -0.1378 0.0631 0.0894 0.1294 0.1273 0.1171 0.0925 0.1100 0.0799 0.0923 0.1479 0.1284 0.1609 0.1707 0.1603 0.1529 0.1539 0.1474 0.1485
va: 1.2318 1.2009 1.9935 1.9740 2.0658 3.3612 2.8580 3.0218 3.7740 3.8760 3.8253 3.9460 3.5279 3.9605 3.9214 3.9832 4.0977 3.9488 3.8415 4.0755 4.0485 3.6830 4.0369 3.9326 3.9503 3.9757 3.8355 1.0013 1.0118 1.0176 0.9979 0.9990 1.0082 0.9995 1.0086 1.0236 1.0260 0.9939 1.0007 0.9963 1.0050 1.0020 1.0012 1.0029
dispcorr: -0.026177436 hartree
energy: -2044.711883357268
dipole: 23.99680 -22.68875 1.30805 -9.48186 7.78221 -1.69965 -5.82266 3.94195 -1.88071
magnitude: 2.85252 au
magnitude: 7.25053 debye
