program: Orca
programVersion: 4.2.1
elementType: Cl Cl O O O N N N C C C C C C C C C C C C C C C C C C C H H H H H H H H H H H H H H H H H
charge: 0
multiplicity: 1
keywords: wb97x-d3
keywords: def2-TZVPP
keywords: def2/J RIJCOSX GRIDX6 NOFINALGRIDX
keywords: grid4 nofinalgrid
keywords: scfconv7
keywords: smallprint printgap noloewdin
keywords: NOSOSCF
formula: C19H17Cl2N3O3
InChI: InChI=1/C19H17Cl2N3O3/c1-13-9-25-19(27-13,10-24-12-22-11-23-24)17-7-6-16(8-18(17)21)26-15-4-2-14(20)3-5-15/h2-8,11-13H,9-10H2,1H3
44 atoms
Cl 1.565433 -0.392843 2.883781
Cl -7.157721 -2.131871 -2.728812
O  3.195993 -0.229233 0.461996
O  2.547801 1.010511 -1.292393
O  -3.098031 -0.460118 1.148191
N  4.120363 2.410068 0.633786
N  5.024262 2.013548 1.533755
N  6.039928 2.912053 -0.254951
C  2.34476 0.813076 0.078625
C  3.82304 -0.793422 -0.688514
C  2.719957 2.117894 0.788429
C  2.993208 -0.224317 -1.825004
C  0.890497 0.459289 0.372755
C  3.82574 -2.299596 -0.609734
C  0.465885 -0.095995 1.57872
C  -0.091838 0.724435 -0.576736
C  -0.860151 -0.42248 1.807199
C  -1.42845 0.42792 -0.368843
C  -1.805776 -0.163531 0.827195
C  4.741155 2.926548 -0.428089
C  6.150931 2.34061 0.959303
C  -3.996755 -0.836444 0.183841
C  -5.29141 -0.357424 0.314598
C  -3.66855 -1.715479 -0.839691
C  -6.27039 -0.761188 -0.57897
C  -4.644472 -2.108659 -1.741846
C  -5.938288 -1.630581 -1.605373
H  4.853382 -0.421641 -0.749757
H  2.502713 2.062061 1.852335
H  2.133342 2.938143 0.374938
H  3.568813 -0.032628 -2.728856
H  2.147527 -0.876005 -2.076771
H  4.398577 -2.651631 0.247811
H  4.287712 -2.715548 -1.505719
H  2.811741 -2.694019 -0.534832
H  0.186622 1.182976 -1.514989
H  -1.163331 -0.867127 2.745588
H  -2.152277 0.665594 -1.136625
H  4.216894 3.322002 -1.282596
H  7.099756 2.166411 1.442008
H  -5.540335 0.323206 1.117922
H  -2.66577 -2.1086 -0.943475
H  -7.280233 -0.390455 -0.472115
H  -4.389871 -2.793537 -2.538674
elementType: Cl O N C H
totalener: -2044.68884606 hartree
nucrepener: 2697.41664452 hartree
electener: -4742.10549058 hartree
oneelecener: -8165.32613932 hartree
twoeener: 3423.22064874 hartree
cpcmener: -0.03475303 hartree
kineticenergy: 2038.71604041 hartree
xcener: -149.989995681798 hartree
chargesum: -0.0000000
charge: -0.081252 -0.101726 -0.366556 -0.400112 -0.330792 0.118171 -0.349113 -0.416014 0.593618 0.143934 -0.109588 -0.003153 -0.125029 -0.275731 -0.000876 -0.115213 -0.232854 -0.227862 0.286491 0.060107 0.052373 0.315556 -0.264894 -0.216030 -0.105212 -0.125667 0.061226 0.075769 0.133817 0.142111 0.119549 0.091335 0.094460 0.098021 0.078530 0.152348 0.129312 0.158896 0.169280 0.161672 0.152312 0.161219 0.148576 0.148990
qa: -0.0813 -0.1017 -0.3666 -0.4001 -0.3308 0.1182 -0.3491 -0.4160 0.5936 0.1439 -0.1096 -0.0032 -0.1250 -0.2757 -0.0009 -0.1152 -0.2329 -0.2279 0.2865 0.0601 0.0524 0.3156 -0.2649 -0.2160 -0.1052 -0.1257 0.0612 0.0758 0.1338 0.1421 0.1195 0.0913 0.0945 0.0980 0.0785 0.1523 0.1293 0.1589 0.1693 0.1617 0.1523 0.1612 0.1486 0.1490
va: 1.2369 1.2020 2.0092 1.9700 2.0792 3.3831 2.8888 3.0266 3.8240 3.8928 3.7933 3.9148 3.6514 3.9778 3.9936 3.8989 4.1307 3.9818 3.7746 4.0714 4.0545 3.6622 4.0476 3.9658 3.9440 3.9595 3.8416 0.9979 1.0290 1.0080 1.0012 1.0023 1.0039 1.0054 1.0081 1.0222 1.0280 0.9967 1.0048 0.9959 1.0053 0.9940 1.0010 1.0023
dispcorr: -0.024171032 hartree
energy: -2044.713017091325
dipole: 21.73756 -23.09344 -1.35588 0.84454 -1.21850 -0.37396 -7.46462 6.01337 -1.45125
magnitude: 2.02099 au
magnitude: 5.13694 debye
