program: Orca
programVersion: 4.2.1
elementType: Cl Cl O O O N N N C C C C C C C C C C C C C C C C C C C H H H H H H H H H H H H H H H H H
charge: 0
multiplicity: 1
keywords: wb97x-d3
keywords: def2-TZVPP
keywords: def2/J RIJCOSX GRIDX6 NOFINALGRIDX
keywords: grid4 nofinalgrid
keywords: scfconv7
keywords: smallprint printgap noloewdin
keywords: NOSOSCF
formula: C19H17Cl2N3O3
InChI: InChI=1/C19H17Cl2N3O3/c1-13-9-25-19(27-13,10-24-12-22-11-23-24)17-7-6-16(8-18(17)21)26-15-4-2-14(20)3-5-15/h2-8,11-13H,9-10H2,1H3
44 atoms
Cl -0.09618 2.158939 0.199268
Cl -7.389859 -0.720002 -1.80611
O  3.552259 -0.500225 0.089047
O  2.575275 1.310516 -0.774807
O  -2.420018 -2.284867 0.867533
N  4.153033 1.886315 1.488741
N  4.240325 3.141951 1.046769
N  6.280836 2.298811 1.418678
C  2.545504 0.446629 0.315485
C  3.916809 -0.491963 -1.293352
C  2.888307 1.210905 1.596755
C  2.950773 0.527565 -1.889163
C  1.18922 -0.243534 0.461297
C  3.817541 -1.868512 -1.904915
C  -0.024905 0.43868 0.403998
C  1.125694 -1.616606 0.685185
C  -1.243514 -0.210822 0.526811
C  -0.074807 -2.292705 0.804599
C  -1.263276 -1.585527 0.713374
C  5.375829 1.393953 1.701441
C  5.531044 3.348042 1.026314
C  -3.556329 -1.879642 0.220256
C  -4.730194 -1.823028 0.953349
C  -3.556622 -1.590783 -1.137968
C  -5.9173 -1.474599 0.327237
C  -4.739626 -1.230251 -1.761409
C  -5.912127 -1.173099 -1.02442
H  4.947746 -0.131302 -1.365256
H  2.931234 0.508742 2.428766
H  2.126951 1.951463 1.829627
H  3.414779 1.173757 -2.633147
H  2.080401 0.04081 -2.347474
H  4.47639 -2.576656 -1.401992
H  4.121543 -1.82702 -2.952114
H  2.798395 -2.255973 -1.866998
H  2.042228 -2.184565 0.757538
H  -2.161147 0.360737 0.483178
H  -0.087344 -3.362556 0.965941
H  5.553098 0.394914 2.065768
H  5.951174 4.292356 0.716862
H  -4.722684 -2.05361 2.010359
H  -2.646097 -1.646722 -1.720131
H  -6.833404 -1.431532 0.899368
H  -4.740083 -1.003086 -2.818305
elementType: Cl O N C H
totalener: -2044.69929108 hartree
nucrepener: 2711.77057750 hartree
electener: -4756.46986858 hartree
oneelecener: -8194.03032341 hartree
twoeener: 3437.56045482 hartree
cpcmener: -0.03082559 hartree
kineticenergy: 2038.72076762 hartree
xcener: -149.991406357606 hartree
chargesum: -0.0000000
charge: -0.076607 -0.097995 -0.401632 -0.352049 -0.321712 0.125749 -0.348144 -0.415611 0.576662 0.133748 -0.111124 0.017790 -0.144685 -0.281851 0.006999 -0.135936 -0.164165 -0.254214 0.259787 0.055806 0.057378 0.260785 -0.238233 -0.182108 -0.109423 -0.127930 0.068373 0.080575 0.139446 0.136391 0.114889 0.080800 0.097715 0.104009 0.080003 0.154599 0.131980 0.148082 0.171057 0.160370 0.150070 0.158708 0.145620 0.146028
qa: -0.0766 -0.0980 -0.4016 -0.3520 -0.3217 0.1257 -0.3481 -0.4156 0.5767 0.1337 -0.1111 0.0178 -0.1447 -0.2819 0.0070 -0.1359 -0.1642 -0.2542 0.2598 0.0558 0.0574 0.2608 -0.2382 -0.1821 -0.1094 -0.1279 0.0684 0.0806 0.1394 0.1364 0.1149 0.0808 0.0977 0.1040 0.0800 0.1546 0.1320 0.1481 0.1711 0.1604 0.1501 0.1587 0.1456 0.1460
va: 1.2461 1.2057 1.9764 2.0103 2.0859 3.3743 2.8887 3.0288 3.8866 3.9172 3.7803 3.9138 3.5644 3.9654 4.0026 3.9182 3.9740 4.0686 3.7949 4.0638 4.0521 3.7208 4.0396 3.9566 3.9488 3.9642 3.8491 1.0019 1.0062 1.0318 0.9964 1.0044 1.0040 1.0055 1.0035 1.0186 1.0235 1.0083 1.0013 0.9953 1.0052 0.9940 1.0019 1.0035
dispcorr: -0.024373815 hartree
energy: -2044.723664896566
dipole: 28.28870 -28.77341 -0.48471 -11.01861 8.78170 -2.23691 -2.62643 2.24842 -0.37801
magnitude: 2.31983 au
magnitude: 5.89654 debye
