program: Orca
programVersion: 4.2.1
elementType: Cl Cl O O O N N N C C C C C C C C C C C C C C C C C C C H H H H H H H H H H H H H H H H H
charge: 0
multiplicity: 1
keywords: wb97x-d3
keywords: def2-TZVPP
keywords: def2/J RIJCOSX GRIDX6 NOFINALGRIDX
keywords: grid4 nofinalgrid
keywords: scfconv7
keywords: smallprint printgap noloewdin
keywords: NOSOSCF
formula: C19H17Cl2N3O3
InChI: InChI=1/C19H17Cl2N3O3/c1-13-9-25-19(27-13,10-24-12-22-11-23-24)17-7-6-16(8-18(17)21)26-15-4-2-14(20)3-5-15/h2-8,11-13H,9-10H2,1H3
44 atoms
Cl 1.710214 -0.665957 2.724131
Cl -7.641347 -0.375672 -1.970342
O  3.481838 -0.101594 0.441426
O  2.715146 0.916622 -1.375493
O  -2.584656 -1.922702 0.543997
N  3.74912 2.656378 0.645152
N  4.625894 2.487626 1.636479
N  5.551187 3.651473 -0.037268
C  2.439243 0.690699 -0.025045
C  3.958146 -0.91056 -0.629237
C  2.448166 2.045075 0.687221
C  3.340313 -0.252787 -1.873185
C  1.080793 0.011728 0.149035
C  3.572576 -2.364015 -0.461375
C  0.689705 -0.626507 1.325341
C  0.161987 0.017812 -0.896515
C  -0.544066 -1.243135 1.448483
C  -1.072901 -0.601864 -0.807542
C  -1.42114 -1.238299 0.374765
C  4.315996 3.343782 -0.349788
C  5.687826 3.102457 1.186501
C  -3.732539 -1.512398 -0.075345
C  -4.122171 -0.179616 -0.102566
C  -4.543352 -2.49481 -0.622969
C  -5.326158 0.16962 -0.692586
C  -5.754123 -2.147447 -1.201122
C  -6.134506 -0.815707 -1.238105
H  5.047202 -0.819826 -0.638552
H  2.161854 1.940183 1.731267
H  1.721434 2.703837 0.211781
H  4.083655 0.039845 -2.614478
H  2.612919 -0.913205 -2.358744
H  3.968455 -2.772531 0.468582
H  3.984762 -2.95323 -1.282559
H  2.489771 -2.499325 -0.463574
H  0.417136 0.512356 -1.823638
H  -0.824987 -1.73329 2.37139
H  -1.738434 -0.587935 -1.660346
H  3.796619 3.605503 -1.257834
H  6.59713 3.163231 1.764267
H  -3.505244 0.593319 0.337746
H  -4.235419 -3.531997 -0.593903
H  -5.629968 1.207294 -0.712966
H  -6.386514 -2.915539 -1.624941
elementType: Cl O N C H
totalener: -2044.69803349 hartree
nucrepener: 2705.36456465 hartree
electener: -4750.06259813 hartree
oneelecener: -8181.11609466 hartree
twoeener: 3431.05349653 hartree
cpcmener: -0.03076459 hartree
kineticenergy: 2038.71088265 hartree
xcener: -149.990031013174 hartree
chargesum: -0.0000000
charge: -0.075919 -0.099149 -0.363484 -0.388228 -0.322348 0.119648 -0.344047 -0.415814 0.601556 0.200637 -0.105526 -0.042404 -0.204569 -0.299348 0.025799 -0.110204 -0.220696 -0.219674 0.265917 0.064117 0.054215 0.289236 -0.199480 -0.253219 -0.124747 -0.105733 0.063712 0.087771 0.134281 0.140578 0.108861 0.095895 0.091269 0.105647 0.080241 0.153082 0.128345 0.155688 0.167347 0.159887 0.158590 0.149841 0.146258 0.146168
qa: -0.0759 -0.0991 -0.3635 -0.3882 -0.3223 0.1196 -0.3440 -0.4158 0.6016 0.2006 -0.1055 -0.0424 -0.2046 -0.2993 0.0258 -0.1102 -0.2207 -0.2197 0.2659 0.0641 0.0542 0.2892 -0.1995 -0.2532 -0.1247 -0.1057 0.0637 0.0878 0.1343 0.1406 0.1089 0.0959 0.0913 0.1056 0.0802 0.1531 0.1283 0.1557 0.1673 0.1599 0.1586 0.1498 0.1463 0.1462
va: 1.2419 1.2045 2.0069 1.9810 2.0867 3.3745 2.8904 3.0309 3.8405 3.8467 3.7750 3.9359 3.6229 3.9762 3.9531 3.9198 4.1294 3.9863 3.8014 4.0704 4.0571 3.6969 3.9594 4.0444 3.9616 3.9470 3.8512 0.9986 1.0301 1.0077 1.0018 0.9974 1.0094 1.0075 0.9972 1.0196 1.0280 0.9979 1.0033 0.9957 0.9945 1.0057 1.0033 1.0018
dispcorr: -0.024592896 hartree
energy: -2044.722626382478
dipole: 21.82560 -23.10020 -1.27460 -3.33662 2.23050 -1.10613 -8.58301 7.08660 -1.49640
magnitude: 2.25552 au
magnitude: 5.73307 debye
