program: Orca
programVersion: 4.2.1
elementType: Cl Cl O O O N N N C C C C C C C C C C C C C C C C C C C H H H H H H H H H H H H H H H H H
charge: 0
multiplicity: 1
keywords: wb97x-d3
keywords: def2-TZVPP
keywords: def2/J RIJCOSX GRIDX6 NOFINALGRIDX
keywords: grid4 nofinalgrid
keywords: scfconv7
keywords: smallprint printgap noloewdin
keywords: NOSOSCF
formula: C19H17Cl2N3O3
InChI: InChI=1/C19H17Cl2N3O3/c1-13-9-25-19(27-13,10-24-12-22-11-23-24)17-7-6-16(8-18(17)21)26-15-4-2-14(20)3-5-15/h2-8,11-13H,9-10H2,1H3
44 atoms
Cl 2.622925 0.057501 -2.872236
Cl -6.924267 -1.590647 1.296036
O  3.161715 -0.583475 1.567601
O  3.933827 -1.090361 -0.462153
O  -2.201537 0.209001 -1.661045
N  3.01624 2.269265 0.591296
N  2.749216 2.443699 1.886527
N  1.578424 3.892642 0.642652
C  3.155859 -0.16508 0.232233
C  3.493871 -1.973705 1.625946
C  3.85263 1.198327 0.120406
C  3.692123 -2.338253 0.155562
C  1.721255 -0.10038 -0.291797
C  2.424058 -2.783752 2.320057
C  1.398857 0.002858 -1.644206
C  0.658195 -0.069786 0.605801
C  0.088407 0.083292 -2.084404
C  -0.660786 0.025258 0.198298
C  -0.944077 0.089341 -1.157977
C  2.303557 3.131669 -0.138665
C  1.887466 3.428303 1.869646
C  -3.275557 -0.229398 -0.93285
C  -3.338001 -1.527895 -0.444713
C  -4.332437 0.646983 -0.747154
C  -4.46287 -1.946136 0.24653
C  -5.464912 0.225378 -0.067102
C  -5.518544 -1.065882 0.431906
H  4.435953 -2.065327 2.175399
H  4.09967 1.405382 -0.919424
H  4.782602 1.183222 0.688919
H  4.549479 -2.988153 -0.015004
H  2.801042 -2.822354 -0.263708
H  2.269261 -2.445282 3.344815
H  2.728879 -3.830886 2.363917
H  1.470844 -2.734999 1.791298
H  0.862227 -0.112996 1.665783
H  -0.134684 0.148925 -3.141233
H  -1.444763 0.055208 0.942868
H  2.354857 3.172681 -1.215796
H  1.467946 3.832029 2.778139
H  -2.519833 -2.21984 -0.599662
H  -4.277984 1.655481 -1.136199
H  -4.511787 -2.955841 0.630757
H  -6.291688 0.907698 0.075672
elementType: Cl O N C H
totalener: -2044.69719774 hartree
nucrepener: 2772.83443293 hartree
electener: -4817.53163067 hartree
oneelecener: -8316.52885899 hartree
twoeener: 3498.99722832 hartree
cpcmener: -0.03035009 hartree
kineticenergy: 2038.70272009 hartree
xcener: -149.988896627857 hartree
chargesum: 0.0000000
charge: -0.077526 -0.097609 -0.387159 -0.359788 -0.321177 0.126020 -0.345559 -0.399949 0.619782 0.133294 -0.144672 0.006160 -0.138999 -0.287441 0.001961 -0.189037 -0.203340 -0.197606 0.274793 0.071572 0.059739 0.270921 -0.195357 -0.234503 -0.124924 -0.110839 0.069678 0.080345 0.137493 0.124163 0.114901 0.080791 0.098502 0.104160 0.081564 0.154414 0.127083 0.153122 0.163493 0.159770 0.159172 0.150710 0.146376 0.145504
qa: -0.0775 -0.0976 -0.3872 -0.3598 -0.3212 0.1260 -0.3456 -0.3999 0.6198 0.1333 -0.1447 0.0062 -0.1390 -0.2874 0.0020 -0.1890 -0.2033 -0.1976 0.2748 0.0716 0.0597 0.2709 -0.1954 -0.2345 -0.1249 -0.1108 0.0697 0.0803 0.1375 0.1242 0.1149 0.0808 0.0985 0.1042 0.0816 0.1544 0.1271 0.1531 0.1635 0.1598 0.1592 0.1507 0.1464 0.1455
va: 1.2422 1.2059 1.9887 2.0167 2.0898 3.3484 2.8884 3.0342 3.7889 3.9304 3.8964 3.9413 3.5493 3.9489 3.9718 3.9018 4.1118 3.9955 3.8049 4.0561 4.0527 3.7064 3.9723 4.0438 3.9594 3.9484 3.8468 1.0016 1.0101 1.0248 0.9953 1.0026 1.0045 1.0066 1.0023 1.0259 1.0269 0.9995 0.9991 0.9963 0.9943 1.0045 1.0034 1.0021
dispcorr: -0.025754130 hartree
energy: -2044.722951873704
dipole: 17.69654 -17.12704 0.56949 -6.87516 5.06420 -1.81096 10.99493 -11.21470 -0.21978
magnitude: 1.91108 au
magnitude: 4.85757 debye
