program: Gaussian 09
title: 000073494
version: EM64L-G09RevD.01
frameworkgroup: C1[X(C8H13NO7)]
method: RPBEPBE
basis: SDD
operation: Freq
keyword: #p
keyword: freq=noraman
keyword: PBEPBE/SDD
title: #p freq=noraman PBEPBE/SDD
converged: YES YES NO NO
title: Mulliken charges:
elementType: O O O O O O O N C C C C C C C C H H H H H H H H H H H H H
charge: -0.482564 -0.471946 -0.475543 -0.407582 -0.174269 -0.239452 -0.292535 -0.400503 -0.112907 -0.097578 -0.099869 -0.210203 -0.099689 0.172183 0.265878 -0.769353 0.271613 0.245108 0.304004 0.309124 0.330071 0.184805 0.372905 0.370024 0.374303 0.258092 0.256559 0.219099 0.400222
chargesum: 0.00000
title: Mulliken charges with hydrogens summed into heavy atoms:
elementType: O O O O O O O N C C C C C C C C
charge: -0.109659 -0.101922 -0.101240 -0.007360 -0.174269 -0.239452 -0.292535 -0.070432 0.158706 0.147531 0.204135 0.098922 0.085117 0.172183 0.265878 -0.035603
polarizability: 1.27527040e+02 2.65927293e+00 1.22178662e+02 -2.92067546e+00 -1.28187091e+00 9.71109028e+01
1716.lowfreq: -10.6805 -4.8748 -0.0004 -0.0003 0.0005 7.8743 29.6938 47.2247 49.8865
frequency: 29.6162 47.1752 49.8774 64.2224 73.0079 80.8117 94.7371 101.4373 129.7619 152.4293 169.5446 182.9052 248.2004 252.5667 266.0820 288.2528 341.4316 361.3520 391.0174 419.2405 457.0951 468.1686 478.4952 516.4019 546.2229 561.0586 579.4351 595.8586 619.4770 624.6437 644.2047 682.8839 747.9008 816.8251 846.4375 913.5421 919.0423 957.8192 985.0142 1000.8034 1029.8948 1044.1161 1046.9433 1060.4969 1070.4271 1089.2819 1128.8596 1199.6203 1206.6869 1246.1400 1254.0961 1269.0529 1280.5637 1285.8701 1294.5786 1302.4050 1322.3828 1362.2415 1373.9566 1386.1112 1390.7107 1402.6128 1450.0416 1459.2136 1475.7007 1600.3591 1642.3821 1645.4538 2883.1550 2973.6027 2982.3898 2985.5568 3000.7259 3044.4379 3098.7063 3108.0245 3468.0699 3504.1479 3521.0314 3545.8866 3552.7704
redmass: 7.1363 7.3885 4.3294 7.3457 2.0441 2.5814 3.4252 3.8599 4.3718 5.5720 7.4398 3.8562 5.8686 4.1621 4.1974 3.7321 3.2246 4.0648 2.0488 2.7245 2.8698 1.6305 2.2148 3.3676 1.2489 3.1335 3.1014 4.1048 1.9999 1.4151 2.7363 3.0089 3.9471 4.5904 2.4716 3.2181 4.8235 3.9086 2.6568 2.1172 3.0690 1.7318 3.8521 3.0075 2.4111 2.5650 2.6259 1.2295 1.2021 1.2647 1.3424 1.5045 1.3726 1.5027 1.2923 1.3958 1.3077 1.2811 1.4793 1.6430 1.2279 1.7618 1.0517 1.4607 1.4271 6.0475 9.1439 9.3889 1.0868 1.0827 1.0848 1.0796 1.0360 1.0847 1.0981 1.1009 1.0652 1.0644 1.0644 1.0778 1.0654
irintensity: 0.7041 8.8180 1.0176 3.8259 6.7613 4.4595 5.9588 1.5570 3.3136 1.9779 1.1665 22.3171 20.4135 23.8526 26.7443 9.2463 32.4585 9.7329 31.5638 77.3241 25.3636 112.3578 33.4100 17.3387 104.7986 34.9292 21.4729 54.9665 36.4882 127.5131 100.2499 39.1972 14.2223 3.4179 30.6078 13.8341 29.2430 44.7994 108.4207 60.4715 18.1061 7.9779 35.8838 56.8817 121.5454 2.9641 44.0375 28.0818 20.2799 16.4429 33.3695 14.0853 108.6070 97.0951 15.3093 24.7382 24.7384 7.1619 48.5772 1.1347 65.1370 16.1643 18.8682 158.8931 59.8062 157.3009 257.2017 166.7661 111.9053 35.4512 8.4450 33.5822 7.9122 16.1474 8.0425 15.2192 51.9785 27.9355 45.1853 35.7883 30.7365
temp: 298.150 k
press: 1.00000 atm
elementType: 8 8 8 8 8 8 8 7 6 6 6 6 6 6 6 6 1 1 1 1 1 1 1 1 1 1 1 1 1
symmnumber: 1
zpe: 572375.5 jmol-1
zpe.correction: 0.218006 hartree
zpe.thermalcorrener: 0.236024 hartree
zpe.thermalcorrenthalpy: 0.236968 hartree
zpe.thermalcorrgfe: 0.170695 hartree
zpe.sumelectzpe: -892.699996 hartree
zpe.sumelectthermal: -892.681979 hartree
zpe.sumelectthermalent: -892.681034 hartree
zpe.sumelectthermalfe: -892.747307 hartree
dipole: -1.6311 -1.1923 0.6999
dipole: 2.1382
quadrupole: -83.9341 -106.0754 -92.9916
quadrupole: 6.2593 -4.7218 -7.3165
quadrupole: 10.3996 -11.7417 1.3421 6.2593 -4.7218 -7.3165
hfenergy: -892.9180022 hartree
pointgroup: C01[X(C8H13N1O7)]
dipole: -0.6250839 0.4043082 -0.391773 debye
polarizability: 126.9626879|-1.6371523|121.091505|5.5867787|-5.0652716|98.7624123 unknown
InChI: InChI=1S/C8H13NO7/c1-3(11)9-4(2-10)5(12)6(13)7(14)8(15)16/h2,4-7,9,12-15H,1H3
charge 0 multiplicity 1
29 atoms
O  -0.591932 -1.493927 -1.910538
O  1.877455 -0.220414 -1.961583
O  2.340919 2.0809 -0.576452
O  1.71581 -0.674528 1.770727
O  -1.036443 -3.084116 1.049378
O  3.633706 0.52104 1.219237
O  -1.701851 1.908461 1.070776
N  -2.179282 0.095097 -0.299732
C  0.03523 -0.989864 -0.674855
C  0.84843 0.264888 -1.034894
C  -1.132212 -0.739082 0.295342
C  1.517035 1.079601 0.109534
C  -1.714248 -2.058034 0.82702
C  2.413149 0.287415 1.06041
C  -2.383764 1.401945 0.122501
C  -3.472928 2.176385 -0.604355
H  0.697199 -1.761487 -0.241312
H  0.183199 0.983908 -1.55848
H  -0.762083 -0.187548 1.18514
H  0.723298 1.572535 0.70766
H  -2.594906 -0.241565 -1.17145
H  -2.81331 -2.015151 1.038747
H  0.133733 -1.609438 -2.577248
H  2.454412 0.562547 -2.171825
H  3.218358 2.130996 -0.10554
H  -4.270399 2.435061 0.113904
H  -3.054453 3.124947 -0.981066
H  -3.91964 1.617514 -1.444023
H  2.316216 -1.163286 2.396078
