program: Orca
programVersion: 4.2.1
elementType: Cl Cl O O O N N N C C C C C C C C C C C C C C C C C C C H H H H H H H H H H H H H H H H H
charge: 0
multiplicity: 1
keywords: wb97x-d3
keywords: def2-TZVPP
keywords: def2/J RIJCOSX GRIDX6 NOFINALGRIDX
keywords: grid4 nofinalgrid
keywords: scfconv7
keywords: smallprint printgap noloewdin
keywords: NOSOSCF
formula: C19H17Cl2N3O3
InChI: InChI=1/C19H17Cl2N3O3/c1-13-9-25-19(27-13,10-24-12-22-11-23-24)17-7-6-16(8-18(17)21)26-15-4-2-14(20)3-5-15/h2-8,11-13H,9-10H2,1H3
44 atoms
Cl 0.508075 -0.25211 2.058476
Cl -7.615163 -0.869449 0.835868
O  3.198238 -0.200986 0.85387
O  3.46525 0.477547 -1.268518
O  -2.455052 -1.460967 -1.866595
N  3.702681 2.559395 0.668523
N  4.497596 3.164073 -0.217494
N  5.483092 3.083571 1.791936
C  2.59812 0.529816 -0.169752
C  4.174827 -1.069407 0.289618
C  2.439346 1.98703 0.287456
C  4.61829 -0.27465 -0.929502
C  1.232983 -0.022971 -0.571025
C  3.611465 -2.438668 -0.03375
C  0.250087 -0.382652 0.348248
C  0.904611 -0.144691 -1.919436
C  -0.992485 -0.859058 -0.044834
C  -0.330476 -0.600345 -2.340435
C  -1.280365 -0.962022 -1.397541
C  4.307033 2.508519 1.858586
C  5.55037 3.462009 0.499601
C  -3.62386 -1.292565 -1.177517
C  -4.479101 -2.381591 -1.108253
C  -3.992054 -0.070281 -0.630332
C  -5.714387 -2.251831 -0.493462
C  -5.221516 0.056272 -0.003537
C  -6.075083 -1.034128 0.060273
H  4.979369 -1.16317 1.021114
H  1.758304 2.052151 1.135185
H  2.018259 2.584758 -0.519853
H  5.458344 0.389476 -0.704741
H  4.896469 -0.905656 -1.775311
H  2.880319 -2.408639 -0.843262
H  3.1332 -2.878701 0.841872
H  4.418692 -3.105266 -0.340551
H  1.630971 0.130334 -2.670552
H  -1.715086 -1.151018 0.705696
H  -0.55372 -0.679516 -3.396194
H  3.85387 2.063231 2.730226
H  6.397309 3.98074 0.077406
H  -4.187036 -3.329715 -1.540363
H  -3.339814 0.791268 -0.692756
H  -6.382019 -3.101136 -0.444878
H  -5.509427 1.008475 0.420562
elementType: Cl O N C H
totalener: -2044.69770368 hartree
nucrepener: 2715.35976519 hartree
electener: -4760.05746887 hartree
oneelecener: -8201.13378909 hartree
twoeener: 3441.07632022 hartree
cpcmener: -0.02826513 hartree
kineticenergy: 2038.69877091 hartree
xcener: -149.988918155975 hartree
chargesum: -0.0000000
charge: -0.079527 -0.098856 -0.375399 -0.388049 -0.320130 0.132725 -0.356495 -0.409025 0.561723 0.199971 -0.133305 -0.015581 -0.163852 -0.304522 0.038871 -0.110673 -0.180565 -0.258443 0.277901 0.063516 0.057967 0.290596 -0.256868 -0.203477 -0.101608 -0.122749 0.061547 0.094573 0.144587 0.129094 0.088207 0.098561 0.091723 0.090332 0.103823 0.145678 0.133145 0.148254 0.164435 0.159950 0.150534 0.159042 0.145487 0.146884
qa: -0.0795 -0.0989 -0.3754 -0.3880 -0.3201 0.1327 -0.3565 -0.4090 0.5617 0.2000 -0.1333 -0.0156 -0.1639 -0.3045 0.0389 -0.1107 -0.1806 -0.2584 0.2779 0.0635 0.0580 0.2906 -0.2569 -0.2035 -0.1016 -0.1227 0.0615 0.0946 0.1446 0.1291 0.0882 0.0986 0.0917 0.0903 0.1038 0.1457 0.1331 0.1483 0.1644 0.1599 0.1505 0.1590 0.1455 0.1469
va: 1.2420 1.2046 1.9905 1.9880 2.0905 3.3656 2.8773 3.0298 3.8815 3.8501 3.8039 3.9980 3.5699 3.9680 3.9592 3.9076 4.0033 4.0642 3.7843 4.0692 4.0453 3.6942 4.0485 3.9649 3.9447 3.9597 3.8491 0.9984 1.0154 1.0233 0.9965 0.9971 0.9961 1.0123 1.0072 1.0272 1.0230 1.0079 1.0034 0.9961 1.0058 0.9936 1.0019 1.0029
dispcorr: -0.024948450 hartree
energy: -2044.722652129433
dipole: 28.10813 -28.49750 -0.38937 -3.69870 2.33297 -1.36572 -9.58761 8.86038 -0.72722
magnitude: 1.59551 au
magnitude: 4.05547 debye
