program: Orca
programVersion: 4.2.1
elementType: Cl Cl O O O N N N C C C C C C C C C C C C C C C C C C C H H H H H H H H H H H H H H H H H
charge: 0
multiplicity: 1
keywords: wb97x-d3
keywords: def2-TZVPP
keywords: def2/J RIJCOSX GRIDX6 NOFINALGRIDX
keywords: grid4 nofinalgrid
keywords: scfconv7
keywords: smallprint printgap noloewdin
keywords: NOSOSCF
formula: C19H17Cl2N3O3
InChI: InChI=1/C19H17Cl2N3O3/c1-13-9-25-19(27-13,10-24-12-22-11-23-24)17-7-6-16(8-18(17)21)26-15-4-2-14(20)3-5-15/h2-8,11-13H,9-10H2,1H3
44 atoms
Cl 2.273208 1.219341 -2.147419
Cl -7.084567 -2.67241 0.6960
O  2.967045 -1.193192 1.596772
O  3.816325 -0.337425 -0.270794
O  -2.502344 0.570819 -0.966104
N  3.359039 2.345826 0.784342
N  2.279005 3.12258 0.678422
N  3.979681 3.979278 -0.498993
C  2.892691 -0.088422 0.736418
C  3.432386 -2.323105 0.85198
C  3.34666 1.127648 1.548188
C  3.737351 -1.725648 -0.525235
C  1.462906 0.072569 0.215062
C  2.418569 -3.442421 0.82377
C  1.107024 0.633979 -1.009488
C  0.416866 -0.317054 1.04963
C  -0.218924 0.758038 -1.396631
C  -0.914649 -0.17913 0.702423
C  -1.22907 0.355662 -0.538801
C  4.362926 2.864772 0.072537
C  2.697104 4.087405 -0.099215
C  -3.528989 -0.220947 -0.531115
C  -3.453121 -1.607181 -0.565196
C  -4.691628 0.41129 -0.119112
C  -4.54887 -2.362466 -0.179588
C  -5.792642 -0.343303 0.254665
C  -5.711785 -1.725898 0.226325
H  4.351143 -2.673089 1.331619
H  4.354398 0.944342 1.922285
H  2.688839 1.268249 2.404641
H  4.687406 -2.061677 -0.938663
H  2.946249 -1.954606 -1.250283
H  2.182967 -3.791579 1.829455
H  2.825604 -4.290704 0.270466
H  1.490269 -3.139239 0.337108
H  0.644396 -0.743288 2.016946
H  -0.470661 1.18087 -2.360268
H  -1.681713 -0.484287 1.401546
H  5.338196 2.407936 0.012067
H  2.053969 4.905374 -0.384892
H  -2.554111 -2.109552 -0.89898
H  -4.744057 1.492033 -0.098314
H  -4.491528 -3.441924 -0.208268
H  -6.700552 0.151838 0.570783
elementType: Cl O N C H
totalener: -2044.69582419 hartree
nucrepener: 2764.95657251 hartree
electener: -4809.65239670 hartree
oneelecener: -8301.13818602 hartree
twoeener: 3491.48578932 hartree
cpcmener: -0.03044439 hartree
kineticenergy: 2038.70585306 hartree
xcener: -149.990294156156 hartree
chargesum: 0.0000000
charge: -0.078726 -0.098869 -0.397892 -0.360001 -0.321334 0.100400 -0.345309 -0.400665 0.611957 0.157511 -0.076653 -0.026373 -0.072647 -0.288181 -0.014887 -0.222996 -0.194685 -0.188867 0.251552 0.064225 0.058487 0.281741 -0.197282 -0.244555 -0.126706 -0.108400 0.066655 0.085553 0.123229 0.130357 0.115034 0.086620 0.095895 0.103485 0.079978 0.143171 0.125539 0.154642 0.168561 0.159433 0.159566 0.149559 0.145756 0.146120
qa: -0.0787 -0.0989 -0.3979 -0.3600 -0.3213 0.1004 -0.3453 -0.4007 0.6120 0.1575 -0.0767 -0.0264 -0.0726 -0.2882 -0.0149 -0.2230 -0.1947 -0.1889 0.2516 0.0642 0.0585 0.2817 -0.1973 -0.2446 -0.1267 -0.1084 0.0667 0.0856 0.1232 0.1304 0.1150 0.0866 0.0959 0.1035 0.0800 0.1432 0.1255 0.1546 0.1686 0.1594 0.1596 0.1496 0.1458 0.1461
va: 1.2372 1.2046 1.9784 2.0083 2.0875 3.3657 2.8682 3.0272 3.7943 3.8958 3.8522 3.9505 3.5237 3.9647 3.9440 4.0081 4.0882 3.9460 3.8168 4.0725 4.0535 3.7031 3.9668 4.0449 3.9634 3.9466 3.8473 1.0023 1.0190 1.0112 0.9980 1.0027 1.0052 1.0070 1.0016 1.0265 1.0290 0.9977 0.9993 0.9965 0.9949 1.0055 1.0034 1.0018
dispcorr: -0.025648422 hartree
energy: -2044.721472611586
dipole: 18.85927 -18.34949 0.50977 -9.74210 7.38144 -2.36066 7.80939 -6.95294 0.85645
magnitude: 2.56244 au
magnitude: 6.51320 debye
