program: Orca
programVersion: 4.2.1
elementType: Cl Cl O O O N N N C C C C C C C C C C C C C C C C C C C H H H H H H H H H H H H H H H H H
charge: 0
multiplicity: 1
keywords: wb97x-d3
keywords: def2-TZVPP
keywords: def2/J RIJCOSX GRIDX6 NOFINALGRIDX
keywords: grid4 nofinalgrid
keywords: scfconv7
keywords: smallprint printgap noloewdin
keywords: NOSOSCF
formula: C19H17Cl2N3O3
InChI: InChI=1/C19H17Cl2N3O3/c1-13-9-25-19(27-13,10-24-12-22-11-23-24)17-7-6-16(8-18(17)21)26-15-4-2-14(20)3-5-15/h2-8,11-13H,9-10H2,1H3
44 atoms
Cl 1.648846 -0.64767 2.812953
Cl -7.329638 -1.783264 -2.551445
O  3.208247 -0.385263 0.358071
O  2.541118 0.956323 -1.316025
O  -3.065817 -0.461032 1.237465
N  4.165744 2.296833 0.561783
N  5.150517 1.827845 1.331078
N  5.98684 3.011362 -0.376101
C  2.375822 0.692748 0.048667
C  3.937375 -0.782134 -0.799156
C  2.788896 1.960556 0.808427
C  3.094178 -0.200101 -1.917593
C  0.923997 0.35499 0.37149
C  4.092198 -2.281567 -0.834011
C  0.519149 -0.245146 1.562741
C  -0.078316 0.696257 -0.531871
C  -0.810306 -0.536458 1.819286
C  -1.417329 0.436777 -0.293257
C  -1.778467 -0.196945 0.886639
C  4.678608 2.993526 -0.456229
C  6.221633 2.280767 0.732403
C  -4.012071 -0.756329 0.297171
C  -3.759222 -1.595746 -0.779934
C  -5.282033 -0.23764 0.501407
C  -4.782914 -1.905819 -1.661115
C  -6.309046 -0.558985 -0.371391
C  -6.050902 -1.386806 -1.451984
H  4.928779 -0.3122 -0.787422
H  2.657951 1.832483 1.880953
H  2.159003 2.79312 0.493947
H  3.674907 0.100289 -2.788705
H  2.308923 -0.895169 -2.239753
H  3.124145 -2.784124 -0.846488
H  4.656044 -2.639856 0.027334
H  4.641593 -2.575319 -1.729202
H  0.187035 1.188972 -1.456847
H  -1.099612 -1.015988 2.745137
H  -2.155837 0.73633 -1.024898
H  4.07096 3.471288 -1.208035
H  7.211829 2.086052 1.114542
H  -2.777721 -2.022227 -0.941742
H  -5.473758 0.410765 1.346422
H  -4.585171 -2.559338 -2.499631
H  -7.298987 -0.156413 -0.20634
elementType: Cl O N C H
totalener: -2044.69914866 hartree
nucrepener: 2691.35483421 hartree
electener: -4736.05398287 hartree
oneelecener: -8153.18416344 hartree
twoeener: 3417.13018057 hartree
cpcmener: -0.02959496 hartree
kineticenergy: 2038.70100845 hartree
xcener: -149.987515646569 hartree
chargesum: 0.0000000
charge: -0.077791 -0.099623 -0.356060 -0.396717 -0.321085 0.115093 -0.345165 -0.407685 0.582628 0.127415 -0.120432 0.012527 -0.110875 -0.270801 0.001588 -0.113648 -0.230862 -0.226327 0.281095 0.058319 0.053113 0.311592 -0.216978 -0.261078 -0.122383 -0.103373 0.060216 0.068802 0.134040 0.138004 0.114607 0.087131 0.078535 0.096344 0.094597 0.149274 0.128591 0.156739 0.170174 0.159619 0.158801 0.149535 0.145972 0.146529
qa: -0.0778 -0.0996 -0.3561 -0.3967 -0.3211 0.1151 -0.3452 -0.4077 0.5826 0.1274 -0.1204 0.0125 -0.1109 -0.2708 0.0016 -0.1136 -0.2309 -0.2263 0.2811 0.0583 0.0531 0.3116 -0.2170 -0.2611 -0.1224 -0.1034 0.0602 0.0688 0.1340 0.1380 0.1146 0.0871 0.0785 0.0963 0.0946 0.1493 0.1286 0.1567 0.1702 0.1596 0.1588 0.1495 0.1460 0.1465
va: 1.2401 1.2038 2.0229 1.9764 2.0915 3.3868 2.8798 3.0312 3.8311 3.9354 3.8092 3.9125 3.6653 3.9721 4.0057 3.9007 4.1257 3.9800 3.7875 4.0664 4.0478 3.6786 3.9658 4.0471 3.9598 3.9456 3.8509 0.9965 1.0291 1.0073 1.0006 1.0027 1.0105 1.0035 1.0050 1.0245 1.0279 0.9975 1.0016 0.9967 0.9949 1.0062 1.0033 1.0016
dispcorr: -0.024031357 hartree
energy: -2044.723180016689
dipole: 22.83124 -24.01659 -1.18534 1.17471 -1.43825 -0.26354 -8.02148 6.80427 -1.21721
magnitude: 1.71933 au
magnitude: 4.37019 debye
