program: Orca
programVersion: 4.2.1
elementType: Cl Cl O O O N N N C C C C C C C C C C C C C C C C C C C H H H H H H H H H H H H H H H H H
charge: 0
multiplicity: 1
keywords: wb97x-d3
keywords: def2-TZVPP
keywords: def2/J RIJCOSX GRIDX6 NOFINALGRIDX
keywords: grid4 nofinalgrid
keywords: scfconv7
keywords: smallprint printgap noloewdin
keywords: NOSOSCF
formula: C19H17Cl2N3O3
InChI: InChI=1/C19H17Cl2N3O3/c1-13-9-25-19(27-13,10-24-12-22-11-23-24)17-7-6-16(8-18(17)21)26-15-4-2-14(20)3-5-15/h2-8,11-13H,9-10H2,1H3
44 atoms
Cl 2.543571 -0.367424 -2.945929
Cl -6.929762 -1.367395 1.579589
O  3.200294 -0.345401 1.51728
O  3.934895 -1.097741 -0.447741
O  -2.2462 -0.013454 -1.659383
N  3.036024 2.330923 0.390168
N  2.197998 3.033868 -0.377326
N  2.051676 3.70341 1.757267
C  3.149813 -0.106816 0.133451
C  3.549155 -1.707292 1.741446
C  3.80721 1.246964 -0.153326
C  3.713264 -2.254461 0.320042
C  1.7042 -0.136766 -0.352896
C  2.505389 -2.429531 2.564371
C  1.352574 -0.233109 -1.698623
C  0.664349 0.022221 0.556422
C  0.03129 -0.21785 -2.109497
C  -0.664665 0.059647 0.172619
C  -0.979555 -0.069701 -1.171959
C  2.929965 2.738797 1.664081
C  1.632121 3.844314 0.48163
C  -3.303779 -0.339234 -0.860216
C  -3.375743 -1.56563 -0.212258
C  -4.346484 0.567642 -0.758633
C  -4.492594 -1.879698 0.543033
C  -5.469726 0.249298 -0.011831
C  -5.535698 -0.97094 0.640422
H  4.508202 -1.723669 2.271221
H  3.893319 1.407397 -1.225721
H  4.809146 1.252632 0.278567
H  4.567261 -2.921839 0.206909
H  2.810036 -2.785609 -0.008471
H  2.37182 -1.957874 3.537347
H  2.814913 -3.461194 2.740232
H  1.540997 -2.448061 2.055495
H  0.898675 0.13758 1.604899
H  -0.216637 -0.304478 -3.158418
H  -1.434203 0.20403 0.91849
H  3.504669 2.311401 2.470369
H  0.892608 4.568147 0.177666
H  -2.566706 -2.279599 -0.298602
H  -4.281975 1.518766 -1.270154
H  -4.554179 -2.833808 1.047838
H  -6.286515 0.953284 0.065835
totalener: -2044.66846731 hartree
nucrepener: 2767.75818147 hartree
electener: -4812.42664878 hartree
oneelecener: -8305.92764172 hartree
twoeener: 3493.50099294 hartree
kineticenergy: 2038.71863948 hartree
xcener: -149.989838980162 hartree
chargesum: -0.0000000
charge: -0.062769 -0.077820 -0.374558 -0.319683 -0.296059 0.107945 -0.301996 -0.328941 0.581895 0.108903 -0.100960 0.002397 -0.170491 -0.276126 0.060199 -0.159975 -0.209228 -0.185730 0.247481 0.037530 0.059388 0.242794 -0.176612 -0.202462 -0.107424 -0.092265 0.062383 0.069897 0.129246 0.109501 0.098118 0.074707 0.097921 0.092986 0.079631 0.143232 0.117507 0.134583 0.141985 0.128827 0.134603 0.131410 0.124175 0.123853
qa: -0.0628 -0.0778 -0.3746 -0.3197 -0.2961 0.1079 -0.3020 -0.3289 0.5819 0.1089 -0.1010 0.0024 -0.1705 -0.2761 0.0602 -0.1600 -0.2092 -0.1857 0.2475 0.0375 0.0594 0.2428 -0.1766 -0.2025 -0.1074 -0.0923 0.0624 0.0699 0.1292 0.1095 0.0981 0.0747 0.0979 0.0930 0.0796 0.1432 0.1175 0.1346 0.1420 0.1288 0.1346 0.1314 0.1242 0.1239
va: 1.2610 1.2267 1.9903 2.0500 2.1152 3.3264 2.8551 3.0650 3.8433 3.9587 3.8543 3.9663 3.6116 3.9455 3.9948 3.9004 4.1283 4.0136 3.8596 4.0823 4.0471 3.8234 3.9872 4.0520 3.9795 3.9644 3.9417 0.9996 1.0300 1.0213 0.9950 1.0019 1.0060 1.0098 1.0055 1.0197 1.0302 1.0060 1.0142 1.0024 1.0029 1.0112 1.0106 1.0092
dispcorr: -0.025586881 hartree
energy: -2044.694054193523
dipole: 18.43210 -17.84830 0.58380 -5.34333 3.85590 -1.48743 12.66428 -12.18209 0.48219
magnitude: 1.66907 au
magnitude: 4.24244 debye
