program: Orca
programVersion: 4.2.1
elementType: Cl Cl O O O N N N C C C C C C C C C C C C C C C C C C C H H H H H H H H H H H H H H H H H
charge: 0
multiplicity: 1
keywords: wb97x-d3
keywords: def2-TZVPP
keywords: def2/J RIJCOSX GRIDX6 NOFINALGRIDX
keywords: grid4 nofinalgrid
keywords: scfconv7
keywords: smallprint printgap noloewdin
keywords: NOSOSCF
formula: C19H17Cl2N3O3
InChI: InChI=1/C19H17Cl2N3O3/c1-13-9-25-19(27-13,10-24-12-22-11-23-24)17-7-6-16(8-18(17)21)26-15-4-2-14(20)3-5-15/h2-8,11-13H,9-10H2,1H3
44 atoms
Cl 1.122286 -1.621076 2.070701
Cl -6.879387 0.359625 0.975312
O  3.804662 -1.064326 1.013484
O  4.099772 0.328808 -0.687251
O  -1.945942 -0.977874 -1.881949
N  2.371754 2.270533 0.669657
N  1.060083 2.453612 0.853258
N  1.860538 3.947058 -0.61545
C  3.199399 -0.0173 0.32576
C  4.584237 -1.811516 0.09289
C  3.066556 1.17172 1.28341
C  4.666382 -0.883715 -1.135129
C  1.840009 -0.385062 -0.261236
C  3.971974 -3.163978 -0.209685
C  0.849788 -1.048453 0.461239
C  1.504677 0.058251 -1.53621
C  -0.412595 -1.26414 -0.063308
C  0.245586 -0.131663 -2.077047
C  -0.716046 -0.788235 -1.330312
C  2.831183 3.166154 -0.217323
C  0.799183 3.468774 0.067177
C  -3.059167 -0.646292 -1.166608
C  -4.215431 -1.364112 -1.437094
C  -3.079351 0.388197 -0.23886
C  -5.394614 -1.050587 -0.783301
C  -4.259035 0.693219 0.420759
C  -5.411855 -0.025049 0.148522
H  5.570209 -1.949921 0.54623
H  4.062789 1.492298 1.591797
H  2.509493 0.877733 2.170338
H  5.688213 -0.690153 -1.462015
H  4.10449 -1.296984 -1.981747
H  4.610992 -3.720305 -0.897687
H  2.987884 -3.064325 -0.66922
H  3.864801 -3.75706 0.697481
H  2.239642 0.598575 -2.116274
H  -1.157716 -1.784527 0.5236
H  0.005674 0.241021 -3.063467
H  3.862194 3.209146 -0.531577
H  -0.192408 3.886025 -0.012704
H  -4.190303 -2.165548 -2.163369
H  -2.186123 0.960109 -0.021025
H  -6.295185 -1.610079 -0.99448
H  -4.276668 1.496108 1.144482
totalener: -2044.66789990 hartree
nucrepener: 2806.80824067 hartree
electener: -4851.47614057 hartree
oneelecener: -8384.02811792 hartree
twoeener: 3532.55197735 hartree
kineticenergy: 2038.72229052 hartree
xcener: -149.991095493007 hartree
chargesum: 0.0000000
charge: -0.058627 -0.082750 -0.335487 -0.356671 -0.299597 0.106093 -0.308466 -0.326454 0.598778 0.166909 -0.099854 -0.059874 -0.247788 -0.289256 0.062019 -0.078650 -0.166796 -0.246206 0.241705 0.036010 0.067247 0.242194 -0.219663 -0.147631 -0.089947 -0.128651 0.064109 0.076773 0.110250 0.133087 0.098782 0.087341 0.091503 0.083716 0.098145 0.141468 0.124400 0.129254 0.146164 0.126602 0.127602 0.136859 0.121917 0.123443
qa: -0.0586 -0.0828 -0.3355 -0.3567 -0.2996 0.1061 -0.3085 -0.3265 0.5988 0.1669 -0.0999 -0.0599 -0.2478 -0.2893 0.0620 -0.0786 -0.1668 -0.2462 0.2417 0.0360 0.0672 0.2422 -0.2197 -0.1476 -0.0899 -0.1287 0.0641 0.0768 0.1103 0.1331 0.0988 0.0873 0.0915 0.0837 0.0981 0.1415 0.1244 0.1293 0.1462 0.1266 0.1276 0.1369 0.1219 0.1234
va: 1.2656 1.2220 2.0433 2.0069 2.1077 3.3316 2.8342 3.0692 3.8338 3.8946 3.8343 3.9820 3.6211 3.9648 3.9652 3.8186 4.0319 4.1402 3.8509 4.0809 4.0309 3.8153 4.0405 3.9262 3.9795 4.0146 3.9299 0.9977 1.0262 1.0274 0.9987 0.9939 1.0101 1.0003 1.0096 1.0189 1.0232 1.0132 1.0107 1.0029 1.0133 1.0078 1.0095 1.0115
dispcorr: -0.026734273 hartree
energy: -2044.694634176033
dipole: 27.77828 -26.24408 1.53419 -5.05800 3.90554 -1.15246 -10.78540 10.25663 -0.52877
magnitude: 1.99035 au
magnitude: 5.05908 debye
