program: Orca
programVersion: 4.2.1
elementType: Br Cl Cl O N N N C C C C C C C C C C C C C H H H H H H H H H H H H
charge: 0
multiplicity: 1
keywords: wb97x-d3
keywords: def2-TZVPP
keywords: def2/J RIJCOSX GRIDX6 NOFINALGRIDX
keywords: grid4 nofinalgrid
keywords: scfconv7
keywords: smallprint printgap noloewdin
keywords: NOSOSCF
formula: C13H12BrCl2N3O
InChI: InChI=1/C13H12BrCl2N3O/c14-9-4-13(20-5-9,6-19-8-17-7-18-19)11-2-1-10(15)3-12(11)16/h1-3,7-9H,4-6H2
32 atoms
Br 0.727205 -3.289126 0.373367
Cl 0.728346 1.474612 2.463727
Cl 3.749983 2.415869 -1.81576
O  -1.644057 -1.13908 -0.422613
N  -2.540625 1.547304 -0.119514
N  -3.554313 1.215314 -0.922722
N  -2.549333 3.081443 -1.66114
C  -1.081684 -0.326186 0.590019
C  -0.793911 -1.283415 1.775938
C  -0.961778 -2.665053 1.174733
C  -2.142053 0.716453 0.989518
C  -1.993688 -2.399695 0.108139
C  0.161042 0.349338 0.024918
C  1.002958 1.171776 0.774224
C  0.480367 0.200479 -1.323065
C  2.106719 1.806818 0.223976
C  1.57152 0.823566 -1.902403
C  -1.950614 2.652554 -0.577549
C  2.38065 1.625712 -1.118646
C  -3.520415 2.163374 -1.82138
H  -1.553797 -1.16008 2.553181
H  0.169654 -1.132197 2.252396
H  -1.265417 -3.420059 1.896635
H  -1.791164 1.358997 1.793658
H  -3.031763 0.206191 1.357136
H  -2.029787 -3.128174 -0.700196
H  -2.98322 -2.375987 0.584417
H  -0.137256 -0.427189 -1.946514
H  2.738086 2.432275 0.839225
H  1.780686 0.680274 -2.95306
H  -1.113085 3.1221 -0.086116
H  -4.233918 2.197747 -2.629321
elementType: Br Cl O N C H
totalener: -4236.78674723 hartree
nucrepener: 2352.49487753 hartree
electener: -6589.28162476 hartree
twoeener: 3955.42925575 hartree
cpcmener: -0.03021129 hartree
kineticenergy: 4228.71277106 hartree
xcener: -184.145742771518 hartree
chargesum: 0.0000000
charge: -0.175886 -0.079897 -0.085173 -0.387374 0.143858 -0.354703 -0.413202 0.371197 -0.183075 0.052710 -0.163838 0.000822 -0.035966 -0.073303 -0.134897 -0.112829 -0.170899 0.052098 0.108748 0.059720 0.111704 0.101312 0.140956 0.161084 0.119124 0.103777 0.097166 0.143344 0.122750 0.146918 0.170975 0.162776
qa: -0.1759 -0.0799 -0.0852 -0.3874 0.1439 -0.3547 -0.4132 0.3712 -0.1831 0.0527 -0.1638 0.0008 -0.0360 -0.0733 -0.1349 -0.1128 -0.1709 0.0521 0.1087 0.0597 0.1117 0.1013 0.1410 0.1611 0.1191 0.1038 0.0972 0.1433 0.1227 0.1469 0.1710 0.1628
va: 1.0956 1.2443 1.2188 1.9616 3.3366 2.8944 3.0282 3.7867 3.9192 3.9814 3.8598 4.0099 3.3862 3.9938 3.8950 4.0459 4.0467 4.0803 3.8572 4.0512 1.0130 1.0307 0.9944 1.0076 1.0174 1.0023 0.9950 1.0314 1.0228 1.0048 0.9932 0.9948
dispcorr: -0.020741737 hartree
energy: -4236.807488967999
dipole: -25.45608 24.89444 -0.56164 23.78003 -24.91621 -1.13618 -1.58250 3.67095 2.08845
magnitude: 2.44294 au
magnitude: 6.20946 debye
